BDBM50420022 CHEMBL2032314
SMILES: OC(=O)CCCCCc1ccn2cc(nc2c1)-c1ccc(-c2ccccc2)c(c1)C(F)(F)F
InChI Key: InChIKey=PQYSSMAVSNAZEA-UHFFFAOYSA-N
Data: 2 EC50
Activity Spreadsheet -- Enzyme Inhibition Constant Data from BindingDB
Found 2 hits for monomerid = 50420022
Trg + Lig
Ki
nM
ΔG°
kcal/mole
IC50
nM
Kd
nM
EC50/IC50
nM
koff
s-1
kon
M-1s-1
pHTemp
°C
Sphingosine 1-phosphate receptor 1
(Homo sapiens (Human))
BDBM50420022
(CHEMBL2032314)
Show SMILES OC(=O)CCCCCc1ccn2cc(nc2c1)-c1ccc(-c2ccccc2)c(c1)C(F)(F)F
Show InChI InChI=1S/C26H23F3N2O2/c27-26(28,29)22-16-20(11-12-21(22)19-8-4-2-5-9-19)23-17-31-14-13-18(15-24(31)30-23)7-3-1-6-10-25(32)33/h2,4-5,8-9,11-17H,1,3,6-7,10H2,(H,32,33)
Reactome pathway
n/an/an/an/a 398n/an/an/an/a
GlaxoSmithKline Pharmaceuticals
Curated by ChEMBL
Assay Description
Agonist activity at SIP1 receptor by tango assay
Bioorg Med Chem Lett 22: 3973-7 (2012)
Article DOI: 10.1016/j.bmcl.2012.04.095
BindingDB Entry DOI: 10.7270/Q29P32NS
Sphingosine 1-phosphate receptor 3
(Homo sapiens (Human))
BDBM50420022
(CHEMBL2032314)
Show SMILES OC(=O)CCCCCc1ccn2cc(nc2c1)-c1ccc(-c2ccccc2)c(c1)C(F)(F)F
Show InChI InChI=1S/C26H23F3N2O2/c27-26(28,29)22-16-20(11-12-21(22)19-8-4-2-5-9-19)23-17-31-14-13-18(15-24(31)30-23)7-3-1-6-10-25(32)33/h2,4-5,8-9,11-17H,1,3,6-7,10H2,(H,32,33)
NCI pathway
Reactome pathway
n/an/an/an/a>1.00E+4n/an/an/an/a
GlaxoSmithKline Pharmaceuticals
Curated by ChEMBL
Assay Description
Agonist activity at human SIP3 receptor assessed as calcium mobilization by GeneBLAzer assay
Bioorg Med Chem Lett 22: 3973-7 (2012)
Article DOI: 10.1016/j.bmcl.2012.04.095
BindingDB Entry DOI: 10.7270/Q29P32NS