BDBM50420032 CHEMBL2032434
SMILES: OC(=O)CCN1CCC(CC1)c1ccc2oc(nc2c1)-c1ccc(-c2ccccc2)c(c1)C(F)(F)F
InChI Key: InChIKey=CFXYMBDVVDLAAV-UHFFFAOYSA-N
Data: 2 EC50
Activity Spreadsheet -- Enzyme Inhibition Constant Data from BindingDB
Found 2 hits for monomerid = 50420032
Trg + Lig
Ki
nM
ΔG°
kcal/mole
IC50
nM
Kd
nM
EC50/IC50
nM
koff
s-1
kon
M-1s-1
pHTemp
°C
Sphingosine 1-phosphate receptor 3
(Homo sapiens (Human))
BDBM50420032
(CHEMBL2032434)
Show SMILES OC(=O)CCN1CCC(CC1)c1ccc2oc(nc2c1)-c1ccc(-c2ccccc2)c(c1)C(F)(F)F
Show InChI InChI=1S/C28H25F3N2O3/c29-28(30,31)23-16-21(6-8-22(23)19-4-2-1-3-5-19)27-32-24-17-20(7-9-25(24)36-27)18-10-13-33(14-11-18)15-12-26(34)35/h1-9,16-18H,10-15H2,(H,34,35)
NCI pathway
Reactome pathway
n/an/an/an/a 1.00E+3n/an/an/an/a
GlaxoSmithKline Pharmaceuticals
Curated by ChEMBL
Assay Description
Agonist activity at human SIP3 receptor assessed as calcium mobilization by GeneBLAzer assay
Bioorg Med Chem Lett 22: 3973-7 (2012)
Article DOI: 10.1016/j.bmcl.2012.04.095
BindingDB Entry DOI: 10.7270/Q29P32NS
Sphingosine 1-phosphate receptor 1
(Homo sapiens (Human))
BDBM50420032
(CHEMBL2032434)
Show SMILES OC(=O)CCN1CCC(CC1)c1ccc2oc(nc2c1)-c1ccc(-c2ccccc2)c(c1)C(F)(F)F
Show InChI InChI=1S/C28H25F3N2O3/c29-28(30,31)23-16-21(6-8-22(23)19-4-2-1-3-5-19)27-32-24-17-20(7-9-25(24)36-27)18-10-13-33(14-11-18)15-12-26(34)35/h1-9,16-18H,10-15H2,(H,34,35)
Reactome pathway
n/an/an/an/a 0.0794n/an/an/an/a
GlaxoSmithKline Pharmaceuticals
Curated by ChEMBL
Assay Description
Agonist activity at SIP1 receptor by tango assay
Bioorg Med Chem Lett 22: 3973-7 (2012)
Article DOI: 10.1016/j.bmcl.2012.04.095
BindingDB Entry DOI: 10.7270/Q29P32NS