BDBM50420065 CHEMBL2046682
SMILES: NS(=O)(=O)c1ccc(cc1)C(=O)Nc1ccc(Cl)nc1
InChI Key: InChIKey=YNCIGFJMXBJBAI-UHFFFAOYSA-N
Data: 1 EC50
Activity Spreadsheet -- Enzyme Inhibition Constant Data from BindingDB
Found 1 hit for monomerid = 50420065
Trg + Lig
Ki
nM
ΔG°
kcal/mole
IC50
nM
Kd
nM
EC50/IC50
nM
koff
s-1
kon
M-1s-1
pHTemp
°C
Potassium voltage-gated channel subfamily KQT member 2/3
(Homo sapiens (Human))
BDBM50420065
(CHEMBL2046682)
Show SMILES NS(=O)(=O)c1ccc(cc1)C(=O)Nc1ccc(Cl)nc1
Show InChI InChI=1S/C12H10ClN3O3S/c13-11-6-3-9(7-15-11)16-12(17)8-1-4-10(5-2-8)20(14,18)19/h1-7H,(H,16,17)(H2,14,18,19)
n/an/an/an/a>1.00E+4n/an/an/an/a
TBA
Curated by ChEMBL
Assay Description
Agonist activity at KCNQ2/KCNQ3 expressed in CHO cells assessed as increase in KCl-induced 86Rb+ efflux incubated for 10 mins prior to KCl-induction ...
ACS Med Chem Lett 2: 481-484 (2011)
Article DOI: 10.1021/ml200053x
BindingDB Entry DOI: 10.7270/Q2R49RVJ