BDBM50420075 CHEMBL2047509
SMILES: CCOc1ccc(cc1F)C(=O)Nc1ccc(Cl)nc1
InChI Key: InChIKey=QBGNVEVBMGHUIV-UHFFFAOYSA-N
Data: 1 IC50  1 EC50
Activity Spreadsheet -- Enzyme Inhibition Constant Data from BindingDB
Found 2 hits for monomerid = 50420075
Trg + Lig
Ki
nM
ΔG°
kcal/mole
IC50
nM
Kd
nM
EC50/IC50
nM
koff
s-1
kon
M-1s-1
pHTemp
°C
Potassium voltage-gated channel subfamily E/KQT member 1
(Homo sapiens (Human))
BDBM50420075
(CHEMBL2047509)
Show SMILES CCOc1ccc(cc1F)C(=O)Nc1ccc(Cl)nc1
Show InChI InChI=1S/C14H12ClFN2O2/c1-2-20-12-5-3-9(7-11(12)16)14(19)18-10-4-6-13(15)17-8-10/h3-8H,2H2,1H3,(H,18,19)
n/an/a>1.00E+5n/an/an/an/an/an/a
TBA
Curated by ChEMBL
Assay Description
Antagonist activity at KCNQ1/MINK expressed in CHO cells assessed as inhibition of KCl-induced 86Rb+ efflux incubated for 10 mins prior to KCl-induct...
ACS Med Chem Lett 2: 481-484 (2011)
Article DOI: 10.1021/ml200053x
BindingDB Entry DOI: 10.7270/Q2R49RVJ
Potassium voltage-gated channel subfamily KQT member 2/3
(Homo sapiens (Human))
BDBM50420075
(CHEMBL2047509)
Show SMILES CCOc1ccc(cc1F)C(=O)Nc1ccc(Cl)nc1
Show InChI InChI=1S/C14H12ClFN2O2/c1-2-20-12-5-3-9(7-11(12)16)14(19)18-10-4-6-13(15)17-8-10/h3-8H,2H2,1H3,(H,18,19)
n/an/an/an/a 570n/an/an/an/a
TBA
Curated by ChEMBL
Assay Description
Agonist activity at KCNQ2/KCNQ3 expressed in CHO cells assessed as increase in KCl-induced 86Rb+ efflux incubated for 10 mins prior to KCl-induction ...
ACS Med Chem Lett 2: 481-484 (2011)
Article DOI: 10.1021/ml200053x
BindingDB Entry DOI: 10.7270/Q2R49RVJ