BDBM50420087 CHEMBL2047522
SMILES: Clc1cccc(c1)C(=O)Nc1cnc(Cl)nc1
InChI Key: InChIKey=JBAZNRUHVZSKCH-UHFFFAOYSA-N
Data: 1 IC50  1 EC50
Activity Spreadsheet -- Enzyme Inhibition Constant Data from BindingDB
Found 2 hits for monomerid = 50420087
Trg + Lig
Ki
nM
ΔG°
kcal/mole
IC50
nM
Kd
nM
EC50/IC50
nM
koff
s-1
kon
M-1s-1
pHTemp
°C
Potassium voltage-gated channel subfamily E/KQT member 1
(Homo sapiens (Human))
BDBM50420087
(CHEMBL2047522)
Show SMILES Clc1cccc(c1)C(=O)Nc1cnc(Cl)nc1
Show InChI InChI=1S/C11H7Cl2N3O/c12-8-3-1-2-7(4-8)10(17)16-9-5-14-11(13)15-6-9/h1-6H,(H,16,17)
n/an/a 7.80E+4n/an/an/an/an/an/a
TBA
Curated by ChEMBL
Assay Description
Antagonist activity at KCNQ1/MINK expressed in CHO cells assessed as inhibition of KCl-induced 86Rb+ efflux incubated for 10 mins prior to KCl-induct...
ACS Med Chem Lett 2: 481-484 (2011)
Article DOI: 10.1021/ml200053x
BindingDB Entry DOI: 10.7270/Q2R49RVJ
Potassium voltage-gated channel subfamily KQT member 2/3
(Homo sapiens (Human))
BDBM50420087
(CHEMBL2047522)
Show SMILES Clc1cccc(c1)C(=O)Nc1cnc(Cl)nc1
Show InChI InChI=1S/C11H7Cl2N3O/c12-8-3-1-2-7(4-8)10(17)16-9-5-14-11(13)15-6-9/h1-6H,(H,16,17)
n/an/an/an/a 1.10E+3n/an/an/an/a
TBA
Curated by ChEMBL
Assay Description
Agonist activity at KCNQ2/KCNQ3 expressed in CHO cells assessed as increase in KCl-induced 86Rb+ efflux incubated for 10 mins prior to KCl-induction ...
ACS Med Chem Lett 2: 481-484 (2011)
Article DOI: 10.1021/ml200053x
BindingDB Entry DOI: 10.7270/Q2R49RVJ