null
SMILES: CCc1c(CCCC(O)=O)cccc1-c1cccc(n1)-c1ccc(OC(C)C)c(c1)C#N
InChI Key: InChIKey=XYNFZCMABOUIDI-UHFFFAOYSA-N
Activity Spreadsheet -- Enzyme Inhibition Constant Data from BindingDB
Found 1 hit for monomerid = 50420125
Trg + Lig
Ki
nM
ΔG°
kcal/mole
IC50
nM
Kd
nM
EC50/IC50
nM
koff
s-1
kon
M-1s-1
pHTemp
°C
Sphingosine 1-phosphate receptor 1
(Homo sapiens (Human))
BDBM50420125
(CHEMBL2059668)
Show SMILES CCc1c(CCCC(O)=O)cccc1-c1cccc(n1)-c1ccc(OC(C)C)c(c1)C#N
Show InChI InChI=1S/C27H28N2O3/c1-4-22-19(9-6-13-27(30)31)8-5-10-23(22)25-12-7-11-24(29-25)20-14-15-26(32-18(2)3)21(16-20)17-28/h5,7-8,10-12,14-16,18H,4,6,9,13H2,1-3H3,(H,30,31)
Reactome pathway
n/an/an/an/a>3.16E+3n/an/an/an/a
GlaxoSmithKline
Curated by ChEMBL
Assay Description
Agonist activity against S1P1 receptor by cell based FRET assay
J Med Chem 55: 4286-96 (2012)
Article DOI: 10.1021/jm2016107
BindingDB Entry DOI: 10.7270/Q2F190SQ