BDBM50420284 CHEMBL2089215
SMILES: Nc1[nH]nc2nc(Nc3ccc(NC(=O)Nc4ccc(F)c(Cl)c4)cc3)ncc12
InChI Key: InChIKey=CMZDJOPDAAAGNZ-UHFFFAOYSA-N
Data: 1 IC50
Activity Spreadsheet -- Enzyme Inhibition Constant Data from BindingDB
Found 1 hit for monomerid = 50420284
Trg + Lig
Ki
nM
ΔG°
kcal/mole
IC50
nM
Kd
nM
EC50/IC50
nM
koff
s-1
kon
M-1s-1
pHTemp
°C
Casein kinase I isoform alpha
(Homo sapiens (Human))
BDBM50420284
(CHEMBL2089215)
Show SMILES Nc1[nH]nc2nc(Nc3ccc(NC(=O)Nc4ccc(F)c(Cl)c4)cc3)ncc12
Show InChI InChI=1S/C18H14ClFN8O/c19-13-7-11(5-6-14(13)20)25-18(29)24-10-3-1-9(2-4-10)23-17-22-8-12-15(21)27-28-16(12)26-17/h1-8H,(H2,24,25,29)(H4,21,22,23,26,27,28)
NCI pathway
Reactome pathway
n/an/a>1.00E+4n/an/an/an/an/an/a
TBA
Curated by ChEMBL
Assay Description
Inhibition of CK1 using KRRRALS(p)VASLPGL as substrate after 40 mins by scintillation counter
Eur J Med Chem 56: 30-38 (2012)
Article DOI: 10.1016/j.ejmech.2012.08.007
BindingDB Entry DOI: 10.7270/Q2FJ2J2F