BDBM50420316 CHEMBL2089119
SMILES: Cc1c(Cl)cccc1Cn1c(SCC(O)=O)nc(=O)c2sc(nc12)N1CCOCC1
InChI Key: InChIKey=BAFZKCJTJOBLQE-UHFFFAOYSA-N
Data: 4 IC50
Activity Spreadsheet -- Enzyme Inhibition Constant Data from BindingDB
Found 4 hits for monomerid = 50420316
Trg + Lig
Ki
nM
ΔG°
kcal/mole
IC50
nM
Kd
nM
EC50/IC50
nM
koff
s-1
kon
M-1s-1
pHTemp
°C
Phosphatidylinositol 4,5-bisphosphate 3-kinase catalytic subunit gamma isoform
(Homo sapiens (Human))
BDBM50420316
(CHEMBL2089119)
Show SMILES Cc1c(Cl)cccc1Cn1c(SCC(O)=O)nc(=O)c2sc(nc12)N1CCOCC1
Show InChI InChI=1S/C19H19ClN4O4S2/c1-11-12(3-2-4-13(11)20)9-24-16-15(17(27)22-19(24)29-10-14(25)26)30-18(21-16)23-5-7-28-8-6-23/h2-4H,5-10H2,1H3,(H,25,26)
NCI pathway
Reactome pathway
n/an/a 160n/an/an/an/an/an/a
TBA
Curated by ChEMBL
Assay Description
Inhibition of PI3K gamma by continuous TR-FRET assay
ACS Med Chem Lett 3: 524-529 (2012)
Article DOI: 10.1021/ml300045b
BindingDB Entry DOI: 10.7270/Q2J967PT
Phosphatidylinositol 4,5-bisphosphate 3-kinase catalytic subunit alpha isoform
(Homo sapiens (Human))
BDBM50420316
(CHEMBL2089119)
Show SMILES Cc1c(Cl)cccc1Cn1c(SCC(O)=O)nc(=O)c2sc(nc12)N1CCOCC1
Show InChI InChI=1S/C19H19ClN4O4S2/c1-11-12(3-2-4-13(11)20)9-24-16-15(17(27)22-19(24)29-10-14(25)26)30-18(21-16)23-5-7-28-8-6-23/h2-4H,5-10H2,1H3,(H,25,26)
NCI pathway
Reactome pathway
n/an/a 400n/an/an/an/an/an/a
TBA
Curated by ChEMBL
Assay Description
Inhibition of PI3K alpha by continuous TR-FRET assay
ACS Med Chem Lett 3: 524-529 (2012)
Article DOI: 10.1021/ml300045b
BindingDB Entry DOI: 10.7270/Q2J967PT
Phosphatidylinositol 4,5-bisphosphate 3-kinase catalytic subunit beta isoform
(Homo sapiens (Human))
BDBM50420316
(CHEMBL2089119)
Show SMILES Cc1c(Cl)cccc1Cn1c(SCC(O)=O)nc(=O)c2sc(nc12)N1CCOCC1
Show InChI InChI=1S/C19H19ClN4O4S2/c1-11-12(3-2-4-13(11)20)9-24-16-15(17(27)22-19(24)29-10-14(25)26)30-18(21-16)23-5-7-28-8-6-23/h2-4H,5-10H2,1H3,(H,25,26)
NCI pathway
Reactome pathway
n/an/a 0.0500n/an/an/an/an/an/a
TBA
Curated by ChEMBL
Assay Description
Inhibition of PI3K beta by continuous TR-FRET assay
ACS Med Chem Lett 3: 524-529 (2012)
Article DOI: 10.1021/ml300045b
BindingDB Entry DOI: 10.7270/Q2J967PT
Phosphatidylinositol 4,5-bisphosphate 3-kinase catalytic subunit delta isoform
(Homo sapiens (Human))
BDBM50420316
(CHEMBL2089119)
Show SMILES Cc1c(Cl)cccc1Cn1c(SCC(O)=O)nc(=O)c2sc(nc12)N1CCOCC1
Show InChI InChI=1S/C19H19ClN4O4S2/c1-11-12(3-2-4-13(11)20)9-24-16-15(17(27)22-19(24)29-10-14(25)26)30-18(21-16)23-5-7-28-8-6-23/h2-4H,5-10H2,1H3,(H,25,26)
NCI pathway
Reactome pathway
n/an/a 2n/an/an/an/an/an/a
TBA
Curated by ChEMBL
Assay Description
Inhibition of PI3K delta by continuous TR-FRET assay
ACS Med Chem Lett 3: 524-529 (2012)
Article DOI: 10.1021/ml300045b
BindingDB Entry DOI: 10.7270/Q2J967PT