BDBM50420356 NC 150::PHENAZOPYRIDINE HYDROCHLORIDE
SMILES: Nc1ccc(\N=N\c2ccccc2)c(N)n1
InChI Key: InChIKey=QPFYXYFORQJZEC-FOCLMDBBSA-N
Data: 1 IC50
Activity Spreadsheet -- Enzyme Inhibition Constant Data from BindingDB
Found 1 hit for monomerid = 50420356
Trg + Lig
Ki
nM
ΔG°
kcal/mole
IC50
nM
Kd
nM
EC50/IC50
nM
koff
s-1
kon
M-1s-1
pHTemp
°C
Snake venom metalloproteinase Bap1
(Bothrops asper)
BDBM50420356
(NC 150 | PHENAZOPYRIDINE HYDROCHLORIDE)
Show SMILES Nc1ccc(\N=N\c2ccccc2)c(N)n1
Show InChI InChI=1S/C11H11N5/c12-10-7-6-9(11(13)14-10)16-15-8-4-2-1-3-5-8/h1-7H,(H4,12,13,14)/b16-15+
n/an/a 5.43E+4n/an/an/an/an/an/a
TBA
Curated by ChEMBL
Assay Description
Inhibition of snake venom BaP1 using Abz-Ala-Gly-Leu-Ala-Nba as substrate incubated for 30 mins prior to substrate addition by fluorescence spectroph...
ACS Med Chem Lett 3: 540-543 (2012)
Article DOI: 10.1021/ml300068r
BindingDB Entry DOI: 10.7270/Q2542PVS