BDBM50420359 CHEMBL2089179
SMILES: CCc1cccc(n1)C#Cc1cccc(c1)C#N
InChI Key: InChIKey=MTBVFNCLKSREOT-UHFFFAOYSA-N
Data: 1 KI  1 IC50
Activity Spreadsheet -- Enzyme Inhibition Constant Data from BindingDB
Found 2 hits for monomerid = 50420359
Trg + Lig
Ki
nM
ΔG°
kcal/mole
IC50
nM
Kd
nM
EC50/IC50
nM
koff
s-1
kon
M-1s-1
pHTemp
°C
Metabotropic glutamate receptor
(Rattus norvegicus (Rat))
BDBM50420359
(CHEMBL2089179)
Show SMILES CCc1cccc(n1)C#Cc1cccc(c1)C#N
Show InChI InChI=1S/C16H12N2/c1-2-15-7-4-8-16(18-15)10-9-13-5-3-6-14(11-13)12-17/h3-8,11H,2H2,1H3
Reactome pathway
3.40n/an/an/an/an/an/an/an/a
TBA
Curated by ChEMBL
Assay Description
Displacement of [3H]MPEP from mGluR5 in Sprague-Dawley rat brain membrane after 60 mins by liquid scintillation counting
ACS Med Chem Lett 3: 544-549 (2012)
Article DOI: 10.1021/ml3000726
BindingDB Entry DOI: 10.7270/Q21C1Z4G
Metabotropic glutamate receptor
(Rattus norvegicus (Rat))
BDBM50420359
(CHEMBL2089179)
Show SMILES CCc1cccc(n1)C#Cc1cccc(c1)C#N
Show InChI InChI=1S/C16H12N2/c1-2-15-7-4-8-16(18-15)10-9-13-5-3-6-14(11-13)12-17/h3-8,11H,2H2,1H3
Reactome pathway
n/an/a 80n/an/an/an/an/an/a
TBA
Curated by ChEMBL
Assay Description
Inverse agonist activity at rat mGluR5 expressed in HEK293A cells coexpressing Gqalpha assessed as inhibition of quisqualic-induced D-myo-inositol 1 ...
ACS Med Chem Lett 3: 544-549 (2012)
Article DOI: 10.1021/ml3000726
BindingDB Entry DOI: 10.7270/Q21C1Z4G