null
SMILES: Nc1nc2nc(cnc2c(=O)[nH]1)C(=O)NCc1cccs1
InChI Key: InChIKey=XGQSZNPNBKQIIU-UHFFFAOYSA-N
Activity Spreadsheet -- Enzyme Inhibition Constant Data from BindingDB
Found 1 hit for monomerid = 50420402
Trg + Lig
Ki
nM
ΔG°
kcal/mole
IC50
nM
Kd
nM
EC50/IC50
nM
koff
s-1
kon
M-1s-1
pHTemp
°C
Ricin
(Ricinus communis)
BDBM50420402
(CHEMBL2089308)
Show SMILES Nc1nc2nc(cnc2c(=O)[nH]1)C(=O)NCc1cccs1
Show InChI InChI=1S/C12H10N6O2S/c13-12-17-9-8(11(20)18-12)14-5-7(16-9)10(19)15-4-6-2-1-3-21-6/h1-3,5H,4H2,(H,15,19)(H3,13,16,17,18,20)
n/an/a 4.00E+5n/an/an/an/an/an/a
TBA
Curated by ChEMBL
Assay Description
Inhibition of Ricinus communis ricin toxin A after 90 mins by luciferase reporter gene assay
ACS Med Chem Lett 3: 588-591 (2012)
Article DOI: 10.1021/ml300099t
BindingDB Entry DOI: 10.7270/Q2N29Z7B