BDBM50420753 CHEMBL2087747
SMILES: CN(C)C(C)(C)c1nnc2c(F)c(c(F)cn12)-c1cc(cc(F)c1C)C(=O)NC1CC1
InChI Key: InChIKey=PTXRXMIWYZJYGZ-UHFFFAOYSA-N
Data: 1 IC50
Activity Spreadsheet -- Enzyme Inhibition Constant Data from BindingDB
Found 1 hit for monomerid = 50420753
Trg + Lig
Ki
nM
ΔG°
kcal/mole
IC50
nM
Kd
nM
EC50/IC50
nM
koff
s-1
kon
M-1s-1
pHTemp
°C
Mitogen-activated protein kinase 13 (MAPK13)
(Homo sapiens (Human))
BDBM50420753
(CHEMBL2087747)
Show SMILES CN(C)C(C)(C)c1nnc2c(F)c(c(F)cn12)-c1cc(cc(F)c1C)C(=O)NC1CC1 |(22.02,-8.75,;22.79,-7.42,;24.33,-7.42,;22.03,-6.1,;21.3,-7.45,;23.57,-6.05,;21.22,-4.8,;19.69,-4.95,;19.08,-3.54,;20.22,-2.52,;20.22,-.99,;18.89,-.21,;21.57,-.22,;22.89,-.98,;24.23,-.21,;22.89,-2.53,;21.55,-3.3,;21.57,1.32,;22.9,2.09,;22.9,3.64,;21.56,4.4,;20.24,3.63,;18.9,4.4,;20.23,2.09,;18.9,1.32,;24.23,4.41,;24.22,5.95,;25.57,3.65,;26.9,4.42,;28.44,4.42,;27.66,5.75,)|
Show InChI InChI=1S/C22H24F3N5O/c1-11-14(8-12(9-15(11)23)20(31)26-13-6-7-13)17-16(24)10-30-19(18(17)25)27-28-21(30)22(2,3)29(4)5/h8-10,13H,6-7H2,1-5H3,(H,26,31)
Reactome pathway
n/an/a 15n/an/an/an/an/an/a
Rhône-Poulenc Rorer
Curated by ChEMBL
Assay Description
Inhibition of p38alpha
Bioorg Med Chem Lett 22: 3431-6 (2012)
Article DOI: 10.1016/j.bmcl.2012.03.099
BindingDB Entry DOI: 10.7270/Q2348MNX