BDBM50420761 CHEMBL2087507
SMILES: Cc1c(F)cc(cc1-c1ccn2c(nnc2c1)C1(C)CC1)C(=O)NC1CC1
InChI Key: InChIKey=REGFSKAVJRCHTE-UHFFFAOYSA-N
Data: 1 IC50
Activity Spreadsheet -- Enzyme Inhibition Constant Data from BindingDB
Found 1 hit for monomerid = 50420761
Trg + Lig
Ki
nM
ΔG°
kcal/mole
IC50
nM
Kd
nM
EC50/IC50
nM
koff
s-1
kon
M-1s-1
pHTemp
°C
Mitogen-activated protein kinase 13 (MAPK13)
(Homo sapiens (Human))
BDBM50420761
(CHEMBL2087507)
Show SMILES Cc1c(F)cc(cc1-c1ccn2c(nnc2c1)C1(C)CC1)C(=O)NC1CC1
Show InChI InChI=1S/C21H21FN4O/c1-12-16(9-14(10-17(12)22)19(27)23-15-3-4-15)13-5-8-26-18(11-13)24-25-20(26)21(2)6-7-21/h5,8-11,15H,3-4,6-7H2,1-2H3,(H,23,27)
Reactome pathway
n/an/a 0.640n/an/an/an/an/an/a
Rhône-Poulenc Rorer
Curated by ChEMBL
Assay Description
Inhibition of p38alpha
Bioorg Med Chem Lett 22: 3431-6 (2012)
Article DOI: 10.1016/j.bmcl.2012.03.099
BindingDB Entry DOI: 10.7270/Q2348MNX