BDBM50420763 CHEMBL2087509
SMILES: Cc1c(F)cc(cc1-c1ccn2c(nnc2c1)C1CCC1)C(=O)NC1CC1
InChI Key: InChIKey=MCBRIRDRFHFZOR-UHFFFAOYSA-N
Data: 1 IC50
Activity Spreadsheet -- Enzyme Inhibition Constant Data from BindingDB
Found 1 hit for monomerid = 50420763
Trg + Lig
Ki
nM
ΔG°
kcal/mole
IC50
nM
Kd
nM
EC50/IC50
nM
koff
s-1
kon
M-1s-1
pHTemp
°C
Mitogen-activated protein kinase 13 (MAPK13)
(Homo sapiens (Human))
BDBM50420763
(CHEMBL2087509)
Show SMILES Cc1c(F)cc(cc1-c1ccn2c(nnc2c1)C1CCC1)C(=O)NC1CC1
Show InChI InChI=1S/C21H21FN4O/c1-12-17(9-15(10-18(12)22)21(27)23-16-5-6-16)14-7-8-26-19(11-14)24-25-20(26)13-3-2-4-13/h7-11,13,16H,2-6H2,1H3,(H,23,27)
Reactome pathway
n/an/a 1.90n/an/an/an/an/an/a
Rhône-Poulenc Rorer
Curated by ChEMBL
Assay Description
Inhibition of p38alpha
Bioorg Med Chem Lett 22: 3431-6 (2012)
Article DOI: 10.1016/j.bmcl.2012.03.099
BindingDB Entry DOI: 10.7270/Q2348MNX