BDBM50420767 CHEMBL2087513
SMILES: Cc1c(F)cc(cc1-c1ccn2c(nnc2c1)-c1ccccc1Cl)C(=O)NC1CC1
InChI Key: InChIKey=KJNMNIOIMLFSOY-UHFFFAOYSA-N
Data: 1 IC50
Activity Spreadsheet -- Enzyme Inhibition Constant Data from BindingDB
Found 1 hit for monomerid = 50420767
Trg + Lig
Ki
nM
ΔG°
kcal/mole
IC50
nM
Kd
nM
EC50/IC50
nM
koff
s-1
kon
M-1s-1
pHTemp
°C
Mitogen-activated protein kinase 13 (MAPK13)
(Homo sapiens (Human))
BDBM50420767
(CHEMBL2087513)
Show SMILES Cc1c(F)cc(cc1-c1ccn2c(nnc2c1)-c1ccccc1Cl)C(=O)NC1CC1
Show InChI InChI=1S/C23H18ClFN4O/c1-13-18(10-15(11-20(13)25)23(30)26-16-6-7-16)14-8-9-29-21(12-14)27-28-22(29)17-4-2-3-5-19(17)24/h2-5,8-12,16H,6-7H2,1H3,(H,26,30)
Reactome pathway
n/an/a 1.60n/an/an/an/an/an/a
Rhône-Poulenc Rorer
Curated by ChEMBL
Assay Description
Inhibition of p38alpha
Bioorg Med Chem Lett 22: 3431-6 (2012)
Article DOI: 10.1016/j.bmcl.2012.03.099
BindingDB Entry DOI: 10.7270/Q2348MNX