BDBM50420800 CHEMBL2088036
SMILES: COC(=O)CN1CN(c2ccccc2)C2(CCN(Cc3cccc4ccccc34)CC2)C1=O
InChI Key: InChIKey=AQMPIDSGLFVVPL-UHFFFAOYSA-N
Data: 4 KI  2 EC50
Activity Spreadsheet -- Enzyme Inhibition Constant Data from BindingDB
Found 6 hits for monomerid = 50420800
Trg + Lig
Ki
nM
ΔG°
kcal/mole
IC50
nM
Kd
nM
EC50/IC50
nM
koff
s-1
kon
M-1s-1
pHTemp
°C
Nociceptin receptor
(Homo sapiens (Human))
BDBM50420800
(CHEMBL2088036)
Show SMILES COC(=O)CN1CN(c2ccccc2)C2(CCN(Cc3cccc4ccccc34)CC2)C1=O
Show InChI InChI=1S/C27H29N3O3/c1-33-25(31)19-29-20-30(23-11-3-2-4-12-23)27(26(29)32)14-16-28(17-15-27)18-22-10-7-9-21-8-5-6-13-24(21)22/h2-13H,14-20H2,1H3
Reactome pathway
13n/an/an/an/an/an/an/an/a
Centro de Investigaci�n Lilly
Curated by ChEMBL
Assay Description
Displacement of [3H]Nociceptin from human recombinant NOP receptor expressed in CHO cells by scintillation counter
J Med Chem 55: 4955-67 (2012)
Article DOI: 10.1021/jm201629q
BindingDB Entry DOI: 10.7270/Q2TQ62SQ
Delta-type opioid receptor
(Homo sapiens (Human))
BDBM50420800
(CHEMBL2088036)
Show SMILES COC(=O)CN1CN(c2ccccc2)C2(CCN(Cc3cccc4ccccc34)CC2)C1=O
Show InChI InChI=1S/C27H29N3O3/c1-33-25(31)19-29-20-30(23-11-3-2-4-12-23)27(26(29)32)14-16-28(17-15-27)18-22-10-7-9-21-8-5-6-13-24(21)22/h2-13H,14-20H2,1H3
Reactome pathway
>400n/an/an/an/an/an/an/an/a
Centro de Investigaci�n Lilly
Curated by ChEMBL
Assay Description
Displacement of [3H]diprenorphine from human cloned delta type opioid receptor expressed in CHO cell membranes by scintillation counter
J Med Chem 55: 4955-67 (2012)
Article DOI: 10.1021/jm201629q
BindingDB Entry DOI: 10.7270/Q2TQ62SQ
Mu-type opioid receptor
(Homo sapiens (Human))
BDBM50420800
(CHEMBL2088036)
Show SMILES COC(=O)CN1CN(c2ccccc2)C2(CCN(Cc3cccc4ccccc34)CC2)C1=O
Show InChI InChI=1S/C27H29N3O3/c1-33-25(31)19-29-20-30(23-11-3-2-4-12-23)27(26(29)32)14-16-28(17-15-27)18-22-10-7-9-21-8-5-6-13-24(21)22/h2-13H,14-20H2,1H3
NCI pathway
Reactome pathway
>400n/an/an/an/an/an/an/an/a
Centro de Investigaci�n Lilly
Curated by ChEMBL
Assay Description
Displacement of [3H]diprenorphine from human cloned mu type opioid receptor expressed in CHO cell membranes by scintillation counter
J Med Chem 55: 4955-67 (2012)
Article DOI: 10.1021/jm201629q
BindingDB Entry DOI: 10.7270/Q2TQ62SQ
Kappa-type opioid receptor
(Homo sapiens (Human))
BDBM50420800
(CHEMBL2088036)
Show SMILES COC(=O)CN1CN(c2ccccc2)C2(CCN(Cc3cccc4ccccc34)CC2)C1=O
Show InChI InChI=1S/C27H29N3O3/c1-33-25(31)19-29-20-30(23-11-3-2-4-12-23)27(26(29)32)14-16-28(17-15-27)18-22-10-7-9-21-8-5-6-13-24(21)22/h2-13H,14-20H2,1H3
Reactome pathway
>400n/an/an/an/an/an/an/an/a
Centro de Investigaci�n Lilly
Curated by ChEMBL
Assay Description
Displacement of [3H]diprenorphine from human cloned kappa type opioid receptor expressed in CHO cell membranes by scintillation counter
J Med Chem 55: 4955-67 (2012)
Article DOI: 10.1021/jm201629q
BindingDB Entry DOI: 10.7270/Q2TQ62SQ
Nociceptin receptor
(Homo sapiens (Human))
BDBM50420800
(CHEMBL2088036)
Show SMILES COC(=O)CN1CN(c2ccccc2)C2(CCN(Cc3cccc4ccccc34)CC2)C1=O
Show InChI InChI=1S/C27H29N3O3/c1-33-25(31)19-29-20-30(23-11-3-2-4-12-23)27(26(29)32)14-16-28(17-15-27)18-22-10-7-9-21-8-5-6-13-24(21)22/h2-13H,14-20H2,1H3
Reactome pathway
n/an/an/an/a 121n/an/an/an/a
Centro de Investigaci�n Lilly
Curated by ChEMBL
Assay Description
Agonist activity at human cloned NOP receptor expressed in CHO cell membranes after 30 mins by [35S]GTPgammaS binding assay
J Med Chem 55: 4955-67 (2012)
Article DOI: 10.1021/jm201629q
BindingDB Entry DOI: 10.7270/Q2TQ62SQ
Nociceptin receptor
(Homo sapiens (Human))
BDBM50420800
(CHEMBL2088036)
Show SMILES COC(=O)CN1CN(c2ccccc2)C2(CCN(Cc3cccc4ccccc34)CC2)C1=O
Show InChI InChI=1S/C27H29N3O3/c1-33-25(31)19-29-20-30(23-11-3-2-4-12-23)27(26(29)32)14-16-28(17-15-27)18-22-10-7-9-21-8-5-6-13-24(21)22/h2-13H,14-20H2,1H3
Reactome pathway
n/an/an/an/a 26n/an/an/an/a
ShanghaiTech University
Curated by ChEMBL
Assay Description
Agonist activity at human NOPR expressed in human BHK cells assessed as inhibition of forskolin-mediated cAMP accumulation after 10 mins by radioimmu...
J Med Chem 61: 9841-9878 (2018)
Article DOI: 10.1021/acs.jmedchem.8b00435