BDBM50420845 CHEMBL2086680
SMILES: CC(C)(C)OC(=O)N1CCN(CC1)c1ncc(OCc2ccncc2C#N)cn1
InChI Key: InChIKey=RHLKIVUEHCVGSH-UHFFFAOYSA-N
Data: 2 IC50  4 EC50
Activity Spreadsheet -- Enzyme Inhibition Constant Data from BindingDB
Found 6 hits for monomerid = 50420845
Trg + Lig
Ki
nM
ΔG°
kcal/mole
IC50
nM
Kd
nM
EC50/IC50
nM
koff
s-1
kon
M-1s-1
pHTemp
°C
G-protein coupled receptor 119 (GPR119)
(Homo sapiens (Human))
BDBM50420845
(CHEMBL2086680)
Show SMILES CC(C)(C)OC(=O)N1CCN(CC1)c1ncc(OCc2ccncc2C#N)cn1
Show InChI InChI=1S/C20H24N6O3/c1-20(2,3)29-19(27)26-8-6-25(7-9-26)18-23-12-17(13-24-18)28-14-15-4-5-22-11-16(15)10-21/h4-5,11-13H,6-9,14H2,1-3H3
n/an/an/an/a 21n/an/an/an/a
AstraZeneca
Curated by ChEMBL
Assay Description
Agonist activity at human GPR119 receptor over expressed in HEK293S cells assessed as increase in cAMP level after 45 mins by HTRF assay
J Med Chem 55: 5361-79 (2012)
Article DOI: 10.1021/jm300310c
BindingDB Entry DOI: 10.7270/Q2PZ5B3V
Glucose-dependent insulinotropic receptor
(Mus musculus)
BDBM50420845
(CHEMBL2086680)
Show SMILES CC(C)(C)OC(=O)N1CCN(CC1)c1ncc(OCc2ccncc2C#N)cn1
Show InChI InChI=1S/C20H24N6O3/c1-20(2,3)29-19(27)26-8-6-25(7-9-26)18-23-12-17(13-24-18)28-14-15-4-5-22-11-16(15)10-21/h4-5,11-13H,6-9,14H2,1-3H3
Reactome pathway
n/an/an/an/a 120n/an/an/an/a
AstraZeneca
Curated by ChEMBL
Assay Description
Agonist activity at mouse GPR119 receptor assessed as increase in cAMP level after 45 mins by HTRF assay
J Med Chem 55: 5361-79 (2012)
Article DOI: 10.1021/jm300310c
BindingDB Entry DOI: 10.7270/Q2PZ5B3V
G-protein coupled receptor 119 (GPR119)
(Homo sapiens (Human))
BDBM50420845
(CHEMBL2086680)
Show SMILES CC(C)(C)OC(=O)N1CCN(CC1)c1ncc(OCc2ccncc2C#N)cn1
Show InChI InChI=1S/C20H24N6O3/c1-20(2,3)29-19(27)26-8-6-25(7-9-26)18-23-12-17(13-24-18)28-14-15-4-5-22-11-16(15)10-21/h4-5,11-13H,6-9,14H2,1-3H3
n/an/a 10n/an/an/an/an/an/a
AstraZeneca
Curated by ChEMBL
Assay Description
Displacement of [3H]-N-(2-fluoro-4-methylsulfonyl-phenyl)-6-[4-(3-isopropyl-1,2,4-oxadiazol-5-yl)-1-piperidyl]-5-nitro-pyrimidin-4-amine from human G...
Bioorg Med Chem Lett 23: 3175-9 (2013)
Article DOI: 10.1016/j.bmcl.2013.04.006
BindingDB Entry DOI: 10.7270/Q25Q4XGC
G-protein coupled receptor 119 (GPR119)
(Homo sapiens (Human))
BDBM50420845
(CHEMBL2086680)
Show SMILES CC(C)(C)OC(=O)N1CCN(CC1)c1ncc(OCc2ccncc2C#N)cn1
Show InChI InChI=1S/C20H24N6O3/c1-20(2,3)29-19(27)26-8-6-25(7-9-26)18-23-12-17(13-24-18)28-14-15-4-5-22-11-16(15)10-21/h4-5,11-13H,6-9,14H2,1-3H3
n/an/an/an/a 21n/an/an/an/a
AstraZeneca
Curated by ChEMBL
Assay Description
Agonist activity at human GPR119 overexpressed in HEK293S cells assessed as change in cAMP level after 45 mins by HTRF assay
Bioorg Med Chem Lett 23: 3175-9 (2013)
Article DOI: 10.1016/j.bmcl.2013.04.006
BindingDB Entry DOI: 10.7270/Q25Q4XGC
Glucose-dependent insulinotropic receptor
(Mus musculus)
BDBM50420845
(CHEMBL2086680)
Show SMILES CC(C)(C)OC(=O)N1CCN(CC1)c1ncc(OCc2ccncc2C#N)cn1
Show InChI InChI=1S/C20H24N6O3/c1-20(2,3)29-19(27)26-8-6-25(7-9-26)18-23-12-17(13-24-18)28-14-15-4-5-22-11-16(15)10-21/h4-5,11-13H,6-9,14H2,1-3H3
Reactome pathway
n/an/a 507n/an/an/an/an/an/a
AstraZeneca
Curated by ChEMBL
Assay Description
Displacement of [3H]-N-(2-fluoro-4-methylsulfonyl-phenyl)-6-[4-(3-isopropyl-1,2,4-oxadiazol-5-yl)-1-piperidyl]-5-nitro-pyrimidin-4-amine from mouse G...
Bioorg Med Chem Lett 23: 3175-9 (2013)
Article DOI: 10.1016/j.bmcl.2013.04.006
BindingDB Entry DOI: 10.7270/Q25Q4XGC
Glucose-dependent insulinotropic receptor
(Mus musculus)
BDBM50420845
(CHEMBL2086680)
Show SMILES CC(C)(C)OC(=O)N1CCN(CC1)c1ncc(OCc2ccncc2C#N)cn1
Show InChI InChI=1S/C20H24N6O3/c1-20(2,3)29-19(27)26-8-6-25(7-9-26)18-23-12-17(13-24-18)28-14-15-4-5-22-11-16(15)10-21/h4-5,11-13H,6-9,14H2,1-3H3
Reactome pathway
n/an/an/an/a 120n/an/an/an/a
AstraZeneca
Curated by ChEMBL
Assay Description
Agonist activity at mouse GPR119 overexpressed in HEK293S cells assessed as change in cAMP level after 45 mins by HTRF assay
Bioorg Med Chem Lett 23: 3175-9 (2013)
Article DOI: 10.1016/j.bmcl.2013.04.006
BindingDB Entry DOI: 10.7270/Q25Q4XGC