null
SMILES: Cc1cc(Nc2nc(NCc3cnc(C)cn3)ncc2Br)[nH]n1
InChI Key: InChIKey=SRUVCUHDFMECCJ-UHFFFAOYSA-N
Activity Spreadsheet -- Enzyme Inhibition Constant Data from BindingDB
Found 3 hits for monomerid = 50420943
Trg + Lig
Ki
nM
ΔG°
kcal/mole
IC50
nM
Kd
nM
EC50/IC50
nM
koff
s-1
kon
M-1s-1
pHTemp
°C
Insulin-like growth factor 1 receptor
(Homo sapiens (Human))
BDBM50420943
(CHEMBL2088104)
Show SMILES Cc1cc(Nc2nc(NCc3cnc(C)cn3)ncc2Br)[nH]n1
Show InChI InChI=1S/C14H15BrN8/c1-8-3-12(23-22-8)20-13-11(15)7-19-14(21-13)18-6-10-5-16-9(2)4-17-10/h3-5,7H,6H2,1-2H3,(H3,18,19,20,21,22,23)
Reactome pathway
n/an/a 1.26E+4n/an/an/an/an/an/a
AstraZeneca
Curated by ChEMBL
Assay Description
Inhibition of recombinant N terminal His6-tagged human IGF1R (959 to end) expressed in baculovirus infected Sf21 cells after 80 mins by caliper mobil...
J Med Chem 55: 5003-12 (2012)
Article DOI: 10.1021/jm3004043
BindingDB Entry DOI: 10.7270/Q25X2B62
Fibroblast growth factor receptor 1
(Homo sapiens (Human))
BDBM50420943
(CHEMBL2088104)
Show SMILES Cc1cc(Nc2nc(NCc3cnc(C)cn3)ncc2Br)[nH]n1
Show InChI InChI=1S/C14H15BrN8/c1-8-3-12(23-22-8)20-13-11(15)7-19-14(21-13)18-6-10-5-16-9(2)4-17-10/h3-5,7H,6H2,1-2H3,(H3,18,19,20,21,22,23)
NCI pathway
Reactome pathway
n/an/a 100n/an/an/an/an/an/a
AstraZeneca
Curated by ChEMBL
Assay Description
Inhibition of recombinant N terminal GST-tagged human FGFR1 (456 to 765) expressed in baculovirus infected Sf21 cells after 40 mins by caliper mobili...
J Med Chem 55: 5003-12 (2012)
Article DOI: 10.1021/jm3004043
BindingDB Entry DOI: 10.7270/Q25X2B62
Vascular endothelial growth factor receptor 2
(Homo sapiens (Human))
BDBM50420943
(CHEMBL2088104)
Show SMILES Cc1cc(Nc2nc(NCc3cnc(C)cn3)ncc2Br)[nH]n1
Show InChI InChI=1S/C14H15BrN8/c1-8-3-12(23-22-8)20-13-11(15)7-19-14(21-13)18-6-10-5-16-9(2)4-17-10/h3-5,7H,6H2,1-2H3,(H3,18,19,20,21,22,23)
NCI pathway
Reactome pathway
n/an/a 1.00E+3n/an/an/an/an/an/a
AstraZeneca
Curated by ChEMBL
Assay Description
Inhibition of recombinant N terminal GST-tagged human KDR (805 to 1356) expressed in baculovirus infected Sf9 cells after 90 mins by caliper mobility...
J Med Chem 55: 5003-12 (2012)
Article DOI: 10.1021/jm3004043
BindingDB Entry DOI: 10.7270/Q25X2B62