BDBM50420952 CHEMBL2088258
SMILES: COCCCc1cc(Nc2ccnc(NCc3cc(no3)C(N)=O)n2)[nH]n1
InChI Key: InChIKey=ALJUSBALYODRPB-UHFFFAOYSA-N
Data: 3 IC50
Activity Spreadsheet -- Enzyme Inhibition Constant Data from BindingDB
Found 3 hits for monomerid = 50420952
Trg + Lig
Ki
nM
ΔG°
kcal/mole
IC50
nM
Kd
nM
EC50/IC50
nM
koff
s-1
kon
M-1s-1
pHTemp
°C
Insulin-like growth factor 1 receptor
(Homo sapiens (Human))
BDBM50420952
(CHEMBL2088258)
Show SMILES COCCCc1cc(Nc2ccnc(NCc3cc(no3)C(N)=O)n2)[nH]n1
Show InChI InChI=1S/C16H20N8O3/c1-26-6-2-3-10-7-14(23-22-10)20-13-4-5-18-16(21-13)19-9-11-8-12(15(17)25)24-27-11/h4-5,7-8H,2-3,6,9H2,1H3,(H2,17,25)(H3,18,19,20,21,22,23)
Reactome pathway
n/an/a 1.00E+5n/an/an/an/an/an/a
AstraZeneca
Curated by ChEMBL
Assay Description
Inhibition of recombinant N terminal His6-tagged human IGF1R (959 to end) expressed in baculovirus infected Sf21 cells after 80 mins by caliper mobil...
J Med Chem 55: 5003-12 (2012)
Article DOI: 10.1021/jm3004043
BindingDB Entry DOI: 10.7270/Q25X2B62
Vascular endothelial growth factor receptor 2
(Homo sapiens (Human))
BDBM50420952
(CHEMBL2088258)
Show SMILES COCCCc1cc(Nc2ccnc(NCc3cc(no3)C(N)=O)n2)[nH]n1
Show InChI InChI=1S/C16H20N8O3/c1-26-6-2-3-10-7-14(23-22-10)20-13-4-5-18-16(21-13)19-9-11-8-12(15(17)25)24-27-11/h4-5,7-8H,2-3,6,9H2,1H3,(H2,17,25)(H3,18,19,20,21,22,23)
NCI pathway
Reactome pathway
n/an/a 1.26E+3n/an/an/an/an/an/a
AstraZeneca
Curated by ChEMBL
Assay Description
Inhibition of recombinant N terminal GST-tagged human KDR (805 to 1356) expressed in baculovirus infected Sf9 cells after 90 mins by caliper mobility...
J Med Chem 55: 5003-12 (2012)
Article DOI: 10.1021/jm3004043
BindingDB Entry DOI: 10.7270/Q25X2B62
Fibroblast growth factor receptor 1
(Homo sapiens (Human))
BDBM50420952
(CHEMBL2088258)
Show SMILES COCCCc1cc(Nc2ccnc(NCc3cc(no3)C(N)=O)n2)[nH]n1
Show InChI InChI=1S/C16H20N8O3/c1-26-6-2-3-10-7-14(23-22-10)20-13-4-5-18-16(21-13)19-9-11-8-12(15(17)25)24-27-11/h4-5,7-8H,2-3,6,9H2,1H3,(H2,17,25)(H3,18,19,20,21,22,23)
NCI pathway
Reactome pathway
n/an/a 63.1n/an/an/an/an/an/a
AstraZeneca
Curated by ChEMBL
Assay Description
Inhibition of recombinant N terminal GST-tagged human FGFR1 (456 to 765) expressed in baculovirus infected Sf21 cells after 40 mins by caliper mobili...
J Med Chem 55: 5003-12 (2012)
Article DOI: 10.1021/jm3004043
BindingDB Entry DOI: 10.7270/Q25X2B62