BDBM50421030 CHEMBL2086758
SMILES: CCN1CCC(CC1)Nc1ccc2NC(=O)C(=C(c3ncc[nH]3)c3ccccc3)c2c1
InChI Key: InChIKey=PAUHYDQXWBOZBD-UHFFFAOYSA-N
Data: 7 IC50
Activity Spreadsheet -- Enzyme Inhibition Constant Data from BindingDB
Found 7 hits for monomerid = 50421030
Trg + Lig
Ki
nM
ΔG°
kcal/mole
IC50
nM
Kd
nM
EC50/IC50
nM
koff
s-1
kon
M-1s-1
pHTemp
°C
Vascular endothelial growth factor receptor 2
(Homo sapiens (Human))
BDBM50421030
(CHEMBL2086758)
Show SMILES CCN1CCC(CC1)Nc1ccc2NC(=O)C(=C(c3ncc[nH]3)c3ccccc3)c2c1
Show InChI InChI=1S/C25H27N5O/c1-2-30-14-10-18(11-15-30)28-19-8-9-21-20(16-19)23(25(31)29-21)22(24-26-12-13-27-24)17-6-4-3-5-7-17/h3-9,12-13,16,18,28H,2,10-11,14-15H2,1H3,(H,26,27)(H,29,31)
NCI pathway
Reactome pathway
n/an/a 16n/an/an/an/an/an/a
Exelixis
Curated by ChEMBL
Assay Description
Inhibition of N-terminal GST-tagged KDR after 4 hrs by luciferase-luciferin coupled chemiluminescence assay
Bioorg Med Chem Lett 22: 4979-85 (2012)
Article DOI: 10.1016/j.bmcl.2012.06.029
BindingDB Entry DOI: 10.7270/Q2XG9SD4
Fibroblast growth factor receptor 1
(Homo sapiens (Human))
BDBM50421030
(CHEMBL2086758)
Show SMILES CCN1CCC(CC1)Nc1ccc2NC(=O)C(=C(c3ncc[nH]3)c3ccccc3)c2c1
Show InChI InChI=1S/C25H27N5O/c1-2-30-14-10-18(11-15-30)28-19-8-9-21-20(16-19)23(25(31)29-21)22(24-26-12-13-27-24)17-6-4-3-5-7-17/h3-9,12-13,16,18,28H,2,10-11,14-15H2,1H3,(H,26,27)(H,29,31)
NCI pathway
Reactome pathway
n/an/a 154n/an/an/an/an/an/a
Exelixis
Curated by ChEMBL
Assay Description
Inhibition of FGFR1 in human SK-N-MC cells assessed as inhibition of FGF-induced ERK phosphorylation incubated for 1 hr prior to VEGF-stimulation mea...
Bioorg Med Chem Lett 22: 4979-85 (2012)
Article DOI: 10.1016/j.bmcl.2012.06.029
BindingDB Entry DOI: 10.7270/Q2XG9SD4
Cytochrome P450 3A4
(Homo sapiens (Human))
BDBM50421030
(CHEMBL2086758)
Show SMILES CCN1CCC(CC1)Nc1ccc2NC(=O)C(=C(c3ncc[nH]3)c3ccccc3)c2c1
Show InChI InChI=1S/C25H27N5O/c1-2-30-14-10-18(11-15-30)28-19-8-9-21-20(16-19)23(25(31)29-21)22(24-26-12-13-27-24)17-6-4-3-5-7-17/h3-9,12-13,16,18,28H,2,10-11,14-15H2,1H3,(H,26,27)(H,29,31)
Reactome pathway
n/an/a 2.50E+4n/an/an/an/an/an/a
Exelixis
Curated by ChEMBL
Assay Description
Inhibition of CYP3A4
Bioorg Med Chem Lett 22: 4979-85 (2012)
Article DOI: 10.1016/j.bmcl.2012.06.029
BindingDB Entry DOI: 10.7270/Q2XG9SD4
Vascular endothelial growth factor receptor 2
(Homo sapiens (Human))
BDBM50421030
(CHEMBL2086758)
Show SMILES CCN1CCC(CC1)Nc1ccc2NC(=O)C(=C(c3ncc[nH]3)c3ccccc3)c2c1
Show InChI InChI=1S/C25H27N5O/c1-2-30-14-10-18(11-15-30)28-19-8-9-21-20(16-19)23(25(31)29-21)22(24-26-12-13-27-24)17-6-4-3-5-7-17/h3-9,12-13,16,18,28H,2,10-11,14-15H2,1H3,(H,26,27)(H,29,31)
NCI pathway
Reactome pathway
n/an/a 235n/an/an/an/an/an/a
Exelixis
Curated by ChEMBL
Assay Description
Inhibition of KDR in human HUVEC cells assessed as inhibition of VEGF-induced ERK phosphorylation incubated for 1 hr prior to VEGF-stimulation measur...
Bioorg Med Chem Lett 22: 4979-85 (2012)
Article DOI: 10.1016/j.bmcl.2012.06.029
BindingDB Entry DOI: 10.7270/Q2XG9SD4
Fibroblast growth factor receptor 1
(Homo sapiens (Human))
BDBM50421030
(CHEMBL2086758)
Show SMILES CCN1CCC(CC1)Nc1ccc2NC(=O)C(=C(c3ncc[nH]3)c3ccccc3)c2c1
Show InChI InChI=1S/C25H27N5O/c1-2-30-14-10-18(11-15-30)28-19-8-9-21-20(16-19)23(25(31)29-21)22(24-26-12-13-27-24)17-6-4-3-5-7-17/h3-9,12-13,16,18,28H,2,10-11,14-15H2,1H3,(H,26,27)(H,29,31)
NCI pathway
Reactome pathway
n/an/a 12n/an/an/an/an/an/a
Exelixis
Curated by ChEMBL
Assay Description
Inhibition of N-terminal GST-tagged FGFR1 using poly(Glu,Tyr) as substrate after 30 mins by alphascreen assay
Bioorg Med Chem Lett 22: 4979-85 (2012)
Article DOI: 10.1016/j.bmcl.2012.06.029
BindingDB Entry DOI: 10.7270/Q2XG9SD4
Platelet-derived growth factor receptor alpha
(Homo sapiens (Human))
BDBM50421030
(CHEMBL2086758)
Show SMILES CCN1CCC(CC1)Nc1ccc2NC(=O)C(=C(c3ncc[nH]3)c3ccccc3)c2c1
Show InChI InChI=1S/C25H27N5O/c1-2-30-14-10-18(11-15-30)28-19-8-9-21-20(16-19)23(25(31)29-21)22(24-26-12-13-27-24)17-6-4-3-5-7-17/h3-9,12-13,16,18,28H,2,10-11,14-15H2,1H3,(H,26,27)(H,29,31)
n/an/a 20n/an/an/an/an/an/a
Exelixis
Curated by ChEMBL
Assay Description
Inhibition of N-terminal GST-tagged PDGFRalpha after 2 hrs by luciferase-luciferin coupled chemiluminescence assay
Bioorg Med Chem Lett 22: 4979-85 (2012)
Article DOI: 10.1016/j.bmcl.2012.06.029
BindingDB Entry DOI: 10.7270/Q2XG9SD4
Vascular endothelial growth factor receptor 1
(Homo sapiens (Human))
BDBM50421030
(CHEMBL2086758)
Show SMILES CCN1CCC(CC1)Nc1ccc2NC(=O)C(=C(c3ncc[nH]3)c3ccccc3)c2c1
Show InChI InChI=1S/C25H27N5O/c1-2-30-14-10-18(11-15-30)28-19-8-9-21-20(16-19)23(25(31)29-21)22(24-26-12-13-27-24)17-6-4-3-5-7-17/h3-9,12-13,16,18,28H,2,10-11,14-15H2,1H3,(H,26,27)(H,29,31)
n/an/a 166n/an/an/an/an/an/a
Exelixis
Curated by ChEMBL
Assay Description
Inhibition of N-terminal GST-tagged Flt1 using poly(Glu,Tyr) as substrate after 60 mins by alphascreen assay
Bioorg Med Chem Lett 22: 4979-85 (2012)
Article DOI: 10.1016/j.bmcl.2012.06.029
BindingDB Entry DOI: 10.7270/Q2XG9SD4