BDBM50421136 CHEMBL2088587
SMILES: COc1ccccc1-c1c2ccc(Oc3ccc(F)cc3F)nn2ccc1=O
InChI Key: InChIKey=VDHLUDCDWACJEC-UHFFFAOYSA-N
Data: 2 IC50
Activity Spreadsheet -- Enzyme Inhibition Constant Data from BindingDB
Found 2 hits for monomerid = 50421136
Trg + Lig
Ki
nM
ΔG°
kcal/mole
IC50
nM
Kd
nM
EC50/IC50
nM
koff
s-1
kon
M-1s-1
pHTemp
°C
MAP kinase p38 beta
(Mus musculus (mouse))
BDBM50421136
(CHEMBL2088587)
Show SMILES COc1ccccc1-c1c2ccc(Oc3ccc(F)cc3F)nn2ccc1=O |(-12.43,-43.9,;-11.09,-44.67,;-9.75,-43.9,;-9.75,-42.36,;-8.42,-41.59,;-7.08,-42.35,;-7.08,-43.9,;-8.42,-44.68,;-8.41,-46.21,;-7.08,-46.98,;-5.76,-46.21,;-4.44,-46.97,;-4.43,-48.51,;-3.09,-49.27,;-3.08,-50.81,;-4.42,-51.59,;-4.41,-53.13,;-3.08,-53.89,;-3.07,-55.44,;-1.74,-53.11,;-1.75,-51.57,;-.42,-50.79,;-5.75,-49.28,;-7.08,-48.51,;-8.42,-49.3,;-9.75,-48.52,;-9.75,-46.98,;-11.09,-46.21,)|
Show InChI InChI=1S/C21H14F2N2O3/c1-27-18-5-3-2-4-14(18)21-16-7-9-20(24-25(16)11-10-17(21)26)28-19-8-6-13(22)12-15(19)23/h2-12H,1H3
Reactome pathway
n/an/a 140n/an/an/an/an/an/a
Merck Research Laboratories
Curated by ChEMBL
Assay Description
Inhibition of mouse p38beta assessed as reduction in GST-ATF2 substrate phosphorylation by SPA assay
Bioorg Med Chem Lett 22: 5979-83 (2012)
Article DOI: 10.1016/j.bmcl.2012.07.035
BindingDB Entry DOI: 10.7270/Q28P61S0
MAP kinase p38
(Mus musculus (mouse))
BDBM50421136
(CHEMBL2088587)
Show SMILES COc1ccccc1-c1c2ccc(Oc3ccc(F)cc3F)nn2ccc1=O |(-12.43,-43.9,;-11.09,-44.67,;-9.75,-43.9,;-9.75,-42.36,;-8.42,-41.59,;-7.08,-42.35,;-7.08,-43.9,;-8.42,-44.68,;-8.41,-46.21,;-7.08,-46.98,;-5.76,-46.21,;-4.44,-46.97,;-4.43,-48.51,;-3.09,-49.27,;-3.08,-50.81,;-4.42,-51.59,;-4.41,-53.13,;-3.08,-53.89,;-3.07,-55.44,;-1.74,-53.11,;-1.75,-51.57,;-.42,-50.79,;-5.75,-49.28,;-7.08,-48.51,;-8.42,-49.3,;-9.75,-48.52,;-9.75,-46.98,;-11.09,-46.21,)|
Show InChI InChI=1S/C21H14F2N2O3/c1-27-18-5-3-2-4-14(18)21-16-7-9-20(24-25(16)11-10-17(21)26)28-19-8-6-13(22)12-15(19)23/h2-12H,1H3
Reactome pathway
n/an/a 8.80n/an/an/an/an/an/a
Merck Research Laboratories
Curated by ChEMBL
Assay Description
Inhibition of mouse p38apha assessed as reduction in GST-ATF2 substrate phosphorylation by SPA assay
Bioorg Med Chem Lett 22: 5979-83 (2012)
Article DOI: 10.1016/j.bmcl.2012.07.035
BindingDB Entry DOI: 10.7270/Q28P61S0