BDBM50421277 CHEMBL2087653
SMILES: CNS(=O)(=O)c1ccc(cc1)-c1oc2ncnc(NC[C@@H]3CCCO3)c2c1-c1ccccc1
InChI Key: InChIKey=QTNKXMYRBAGZLL-SFHVURJKSA-N
Data: 1 KI  1 IC50
Activity Spreadsheet -- Enzyme Inhibition Constant Data from BindingDB
Found 2 hits for monomerid = 50421277
Trg + Lig
Ki
nM
ΔG°
kcal/mole
IC50
nM
Kd
nM
EC50/IC50
nM
koff
s-1
kon
M-1s-1
pHTemp
°C
Tyrosine kinase non-receptor protein 2
(Homo sapiens (Human))
BDBM50421277
(CHEMBL2087653)
Show SMILES CNS(=O)(=O)c1ccc(cc1)-c1oc2ncnc(NC[C@@H]3CCCO3)c2c1-c1ccccc1 |r|
Show InChI InChI=1S/C24H24N4O4S/c1-25-33(29,30)19-11-9-17(10-12-19)22-20(16-6-3-2-4-7-16)21-23(27-15-28-24(21)32-22)26-14-18-8-5-13-31-18/h2-4,6-7,9-12,15,18,25H,5,8,13-14H2,1H3,(H,26,27,28)/t18-/m0/s1
4n/an/an/an/an/an/an/an/a
Amgen Inc.
Curated by ChEMBL
Assay Description
Inhibition of N-terminal His6-tagged ACK1 expressed in baculovirus infected Hi5 cells assessed as inhibition of autophosphorylation after 2 hrs by EL...
Bioorg Med Chem Lett 22: 6212-7 (2012)
Article DOI: 10.1016/j.bmcl.2012.08.020
BindingDB Entry DOI: 10.7270/Q2VH5Q4X
Activated CDC42 kinase 1
(Mus musculus)
BDBM50421277
(CHEMBL2087653)
Show SMILES CNS(=O)(=O)c1ccc(cc1)-c1oc2ncnc(NC[C@@H]3CCCO3)c2c1-c1ccccc1 |r|
Show InChI InChI=1S/C24H24N4O4S/c1-25-33(29,30)19-11-9-17(10-12-19)22-20(16-6-3-2-4-7-16)21-23(27-15-28-24(21)32-22)26-14-18-8-5-13-31-18/h2-4,6-7,9-12,15,18,25H,5,8,13-14H2,1H3,(H,26,27,28)/t18-/m0/s1
n/an/a 300n/an/an/an/an/an/a
Amgen Inc.
Curated by ChEMBL
Assay Description
Inhibition of ACK1 in mouse C8 cells assessed as decrease in cell viability after 20 to 24 hrs
Bioorg Med Chem Lett 22: 6212-7 (2012)
Article DOI: 10.1016/j.bmcl.2012.08.020
BindingDB Entry DOI: 10.7270/Q2VH5Q4X