BDBM50421412 CHEMBL2304167
SMILES: CC1C(=O)O[C@H]2[C@H](O)C34[C@H]5C[C@@H](C(C)(C)C)[C@]33[C@@H](OC(=O)[C@@H]3OCOCc3ccccc3)O[C@@]4(C(=O)O5)[C@@]12O
InChI Key: InChIKey=UMHJCILTNURHKG-AUXSEIDFSA-N
Data: 1 IC50
Activity Spreadsheet -- Enzyme Inhibition Constant Data from BindingDB
Found 1 hit for monomerid = 50421412
Trg + Lig
Ki
nM
ΔG°
kcal/mole
IC50
nM
Kd
nM
EC50/IC50
nM
koff
s-1
kon
M-1s-1
pHTemp
°C
Platelet activating factor receptor
(Homo sapiens (Human))
BDBM50421412
(CHEMBL2304167)
Show SMILES CC1C(=O)O[C@H]2[C@H](O)C34[C@H]5C[C@@H](C(C)(C)C)[C@]33[C@@H](OC(=O)[C@@H]3OCOCc3ccccc3)O[C@@]4(C(=O)O5)[C@@]12O
Show InChI InChI=1S/C28H32O11/c1-13-20(30)37-18-17(29)26-16-10-15(24(2,3)4)25(26)19(35-12-34-11-14-8-6-5-7-9-14)21(31)38-23(25)39-28(26,22(32)36-16)27(13,18)33/h5-9,13,15-19,23,29,33H,10-12H2,1-4H3/t13?,15-,16+,17-,18-,19-,23-,25-,26?,27+,28+/m0/s1
Reactome pathway
n/an/a 40n/an/an/an/an/an/a
Chinese Academy of Sciences
Curated by ChEMBL
Assay Description
Compound was evaluated for anti-platelet activating factor potency
Bioorg Med Chem Lett 8: 1291-6 (1999)
BindingDB Entry DOI: 10.7270/Q2VH5PB6