BDBM50421438 CHEMBL63143
SMILES: CC(C)(C(=O)\C=C\c1ccc(cc1)C(N)=N)C(=O)N1CCC(CC(O)=O)CC1
InChI Key: InChIKey=ILSMYHGVTDUMHW-VMPITWQZSA-N
Data: 1 IC50
Activity Spreadsheet -- Enzyme Inhibition Constant Data from BindingDB
Found 1 hit for monomerid = 50421438
Trg + Lig
Ki
nM
ΔG°
kcal/mole
IC50
nM
Kd
nM
EC50/IC50
nM
koff
s-1
kon
M-1s-1
pHTemp
°C
Integrin alpha-IIb/beta-3
(Homo sapiens (Human))
BDBM50421438
(CHEMBL63143)
Show SMILES CC(C)(C(=O)\C=C\c1ccc(cc1)C(N)=N)C(=O)N1CCC(CC(O)=O)CC1
Show InChI InChI=1S/C21H27N3O4/c1-21(2,20(28)24-11-9-15(10-12-24)13-18(26)27)17(25)8-5-14-3-6-16(7-4-14)19(22)23/h3-8,15H,9-13H2,1-2H3,(H3,22,23)(H,26,27)/b8-5+
n/an/a 3.47E+3n/an/an/an/an/an/a
Kyoto University
Curated by ChEMBL
Assay Description
The compound was tested for its inhibitory activity against platelet aggregation
Bioorg Med Chem Lett 10: 859-63 (2000)
BindingDB Entry DOI: 10.7270/Q2W95BFN