BDBM50421447 CHEMBL169139
SMILES: CCCC[C@@H](NC(=O)c1ccc(cc1F)C(N)=N)C(C)(C)C(=O)N1CCC(CC(O)=O)CC1
InChI Key: InChIKey=QULYZHFZLOZQQS-LJQANCHMSA-N
Data: 1 IC50
Activity Spreadsheet -- Enzyme Inhibition Constant Data from BindingDB
Found 1 hit for monomerid = 50421447
Trg + Lig
Ki
nM
ΔG°
kcal/mole
IC50
nM
Kd
nM
EC50/IC50
nM
koff
s-1
kon
M-1s-1
pHTemp
°C
Integrin alpha-IIb/beta-3
(Homo sapiens (Human))
BDBM50421447
(CHEMBL169139)
Show SMILES CCCC[C@@H](NC(=O)c1ccc(cc1F)C(N)=N)C(C)(C)C(=O)N1CCC(CC(O)=O)CC1
Show InChI InChI=1S/C24H35FN4O4/c1-4-5-6-19(28-22(32)17-8-7-16(21(26)27)14-18(17)25)24(2,3)23(33)29-11-9-15(10-12-29)13-20(30)31/h7-8,14-15,19H,4-6,9-13H2,1-3H3,(H3,26,27)(H,28,32)(H,30,31)/t19-/m1/s1
n/an/a 37n/an/an/an/an/an/a
Kyoto University
Curated by ChEMBL
Assay Description
The compound was tested for its inhibitory activity against platelet aggregation
Bioorg Med Chem Lett 10: 859-63 (2000)
BindingDB Entry DOI: 10.7270/Q2W95BFN