BDBM50421484 CHEMBL68130
SMILES: CC(C)(C(OCc1ccccc1)\C=C\c1ccc(cc1)C(N)=N)C(=O)N1CCC(CC(O)=O)CC1
InChI Key: InChIKey=UDIRJUBJLVZQGI-JLHYYAGUSA-N
Data: 1 IC50
Activity Spreadsheet -- Enzyme Inhibition Constant Data from BindingDB
Found 1 hit for monomerid = 50421484
Trg + Lig
Ki
nM
ΔG°
kcal/mole
IC50
nM
Kd
nM
EC50/IC50
nM
koff
s-1
kon
M-1s-1
pHTemp
°C
Integrin alpha-IIb/beta-3
(Homo sapiens (Human))
BDBM50421484
(CHEMBL68130)
Show SMILES CC(C)(C(OCc1ccccc1)\C=C\c1ccc(cc1)C(N)=N)C(=O)N1CCC(CC(O)=O)CC1
Show InChI InChI=1S/C28H35N3O4/c1-28(2,27(34)31-16-14-21(15-17-31)18-25(32)33)24(35-19-22-6-4-3-5-7-22)13-10-20-8-11-23(12-9-20)26(29)30/h3-13,21,24H,14-19H2,1-2H3,(H3,29,30)(H,32,33)/b13-10+
n/an/a 363n/an/an/an/an/an/a
Kyoto University
Curated by ChEMBL
Assay Description
The compound was tested for its inhibitory activity against platelet aggregation
Bioorg Med Chem Lett 10: 859-63 (2000)
BindingDB Entry DOI: 10.7270/Q2W95BFN