BDBM50421556 CHEMBL109183
SMILES: FC(F)(F)c1cc(COCC(N2CCNCC2)c2ccc(Cl)c(Cl)c2)cc(c1)C(F)(F)F
InChI Key: InChIKey=WBWPKPCFEIYLFZ-UHFFFAOYSA-N
Data: 1 KI  2 IC50
Activity Spreadsheet -- Enzyme Inhibition Constant Data from BindingDB
Found 3 hits for monomerid = 50421556
Trg + Lig
Ki
nM
ΔG°
kcal/mole
IC50
nM
Kd
nM
EC50/IC50
nM
koff
s-1
kon
M-1s-1
pHTemp
°C
Neurokinin 1 receptor
(Homo sapiens (Human))
BDBM50421556
(CHEMBL109183)
Show SMILES FC(F)(F)c1cc(COCC(N2CCNCC2)c2ccc(Cl)c(Cl)c2)cc(c1)C(F)(F)F
Show InChI InChI=1S/C21H20Cl2F6N2O/c22-17-2-1-14(9-18(17)23)19(31-5-3-30-4-6-31)12-32-11-13-7-15(20(24,25)26)10-16(8-13)21(27,28)29/h1-2,7-10,19,30H,3-6,11-12H2
Reactome pathway
6.30n/an/an/an/an/an/an/an/a
UCB Pharma
Curated by ChEMBL
Assay Description
Displacement of [3H]-substance P from human NK1 receptor expressed in CHO cells
Bioorg Med Chem Lett 13: 437-42 (2003)
Checked by Author
BindingDB Entry DOI: 10.7270/Q2MC91J0
Neurokinin 1 receptor
(Homo sapiens (Human))
BDBM50421556
(CHEMBL109183)
Show SMILES FC(F)(F)c1cc(COCC(N2CCNCC2)c2ccc(Cl)c(Cl)c2)cc(c1)C(F)(F)F
Show InChI InChI=1S/C21H20Cl2F6N2O/c22-17-2-1-14(9-18(17)23)19(31-5-3-30-4-6-31)12-32-11-13-7-15(20(24,25)26)10-16(8-13)21(27,28)29/h1-2,7-10,19,30H,3-6,11-12H2
Reactome pathway
n/an/a 5n/an/an/an/an/an/a
UCB Pharma SA
Curated by ChEMBL
Assay Description
Binding affinity against human Tachykinin receptor 1 expressed in CHO cells using [3H]-substance P as the radioligand
Bioorg Med Chem Lett 12: 3195-8 (2002)
BindingDB Entry DOI: 10.7270/Q2KW5HBF
Sodium-dependent serotonin transporter
(Rattus norvegicus (rat))
BDBM50421556
(CHEMBL109183)
Show SMILES FC(F)(F)c1cc(COCC(N2CCNCC2)c2ccc(Cl)c(Cl)c2)cc(c1)C(F)(F)F
Show InChI InChI=1S/C21H20Cl2F6N2O/c22-17-2-1-14(9-18(17)23)19(31-5-3-30-4-6-31)12-32-11-13-7-15(20(24,25)26)10-16(8-13)21(27,28)29/h1-2,7-10,19,30H,3-6,11-12H2
n/an/a 200n/an/an/an/an/an/a
UCB Pharma SA
Curated by ChEMBL
Assay Description
Binding affinity against Serotonin transporter in rat cerebral cortex using [3H]paroxetine binding assay.
Bioorg Med Chem Lett 12: 3195-8 (2002)
BindingDB Entry DOI: 10.7270/Q2KW5HBF