BDBM50421693 CHEMBL174433
SMILES: CCc1c(OC)cc(Cc2cnc(N)nc2N)cc1OC
InChI Key: InChIKey=WQVWSMYEWXVIGC-UHFFFAOYSA-N
Data: 2 IC50
Activity Spreadsheet -- Enzyme Inhibition Constant Data from BindingDB
Found 2 hits for monomerid = 50421693
Trg + Lig
Ki
nM
ΔG°
kcal/mole
IC50
nM
Kd
nM
EC50/IC50
nM
koff
s-1
kon
M-1s-1
pHTemp
°C
Dihydrofolate reductase
(Escherichia coli)
BDBM50421693
(CHEMBL174433)
Show SMILES CCc1c(OC)cc(Cc2cnc(N)nc2N)cc1OC
Show InChI InChI=1S/C15H20N4O2/c1-4-11-12(20-2)6-9(7-13(11)21-3)5-10-8-18-15(17)19-14(10)16/h6-8H,4-5H2,1-3H3,(H4,16,17,18,19)
NCI pathway
Reactome pathway
n/an/a 9.90n/an/an/an/an/an/a
TBA
Curated by ChEMBL
Assay Description
Inhibitory activity against Dihydrofolate reductase of Escherichia coli
J Med Chem 24: 933-41 (1982)
BindingDB Entry DOI: 10.7270/Q2SF2XGF
Dihydrofolate reductase
(Rattus norvegicus (rat))
BDBM50421693
(CHEMBL174433)
Show SMILES CCc1c(OC)cc(Cc2cnc(N)nc2N)cc1OC
Show InChI InChI=1S/C15H20N4O2/c1-4-11-12(20-2)6-9(7-13(11)21-3)5-10-8-18-15(17)19-14(10)16/h6-8H,4-5H2,1-3H3,(H4,16,17,18,19)
Reactome pathway
n/an/a 2.00E+5n/an/an/an/an/an/a
TBA
Curated by ChEMBL
Assay Description
Inhibition of rat liver Dihydrofolate reductase.
J Med Chem 24: 933-41 (1982)
BindingDB Entry DOI: 10.7270/Q2SF2XGF