BDBM50421972 CHEMBL611921
SMILES: CCCC(C)N=Nc1nc(N)c2ncn(C3O[C@H](CO)[C@@H](O)[C@H]3O)c2n1
InChI Key: InChIKey=LXBRVQKYISOXIZ-VVLOMEKLSA-N
Data: 2 EC50
Activity Spreadsheet -- Enzyme Inhibition Constant Data from BindingDB
Found 2 hits for monomerid = 50421972
Trg + Lig
Ki
nM
ΔG°
kcal/mole
IC50
nM
Kd
nM
EC50/IC50
nM
koff
s-1
kon
M-1s-1
pHTemp
°C
Adenosine A2 receptor
(Homo sapiens (Human))
BDBM50421972
(CHEMBL611921)
Show SMILES CCCC(C)N=Nc1nc(N)c2ncn(C3O[C@H](CO)[C@@H](O)[C@H]3O)c2n1 |r,w:5.4|
Show InChI InChI=1S/C15H23N7O4/c1-3-4-7(2)20-21-15-18-12(16)9-13(19-15)22(6-17-9)14-11(25)10(24)8(5-23)26-14/h6-8,10-11,14,23-25H,3-5H2,1-2H3,(H2,16,18,19)/t7?,8-,10-,11-,14?/m1/s1
n/an/an/an/a 2n/an/an/an/a
University of South Florida
Curated by ChEMBL
Assay Description
In vitro effect on coronary vasodilation in guinea pig heart.
J Med Chem 35: 4557-61 (1993)
BindingDB Entry DOI: 10.7270/Q21Z43BT
Adenosine A1 receptor
(GUINEA PIG)
BDBM50421972
(CHEMBL611921)
Show SMILES CCCC(C)N=Nc1nc(N)c2ncn(C3O[C@H](CO)[C@@H](O)[C@H]3O)c2n1 |r,w:5.4|
Show InChI InChI=1S/C15H23N7O4/c1-3-4-7(2)20-21-15-18-12(16)9-13(19-15)22(6-17-9)14-11(25)10(24)8(5-23)26-14/h6-8,10-11,14,23-25H,3-5H2,1-2H3,(H2,16,18,19)/t7?,8-,10-,11-,14?/m1/s1
n/an/an/an/a 1.66E+4n/an/an/an/a
University of South Florida
Curated by ChEMBL
Assay Description
In vitro prolonging of the stimulus-QRS interval in guinea pig heart.
J Med Chem 35: 4557-61 (1993)
BindingDB Entry DOI: 10.7270/Q21Z43BT