BDBM50422125 CHEMBL2303942
SMILES: OC[C@H]1O[C@H](Oc2ccccc2-c2cccc(OCC(O)=O)c2)[C@@H](O)[C@H](O)[C@@H]1O
InChI Key: InChIKey=LJEJIHGYRGXSPM-XLSIIYIISA-N
Data: 3 IC50
Activity Spreadsheet -- Enzyme Inhibition Constant Data from BindingDB
Found 3 hits for monomerid = 50422125
Trg + Lig
Ki
nM
ΔG°
kcal/mole
IC50
nM
Kd
nM
EC50/IC50
nM
koff
s-1
kon
M-1s-1
pHTemp
°C
Selectin E
(Homo sapiens (Human))
BDBM50422125
(CHEMBL2303942)
Show SMILES OC[C@H]1O[C@H](Oc2ccccc2-c2cccc(OCC(O)=O)c2)[C@@H](O)[C@H](O)[C@@H]1O |r|
Show InChI InChI=1S/C20H22O9/c21-9-15-17(24)18(25)19(26)20(29-15)28-14-7-2-1-6-13(14)11-4-3-5-12(8-11)27-10-16(22)23/h1-8,15,17-21,24-26H,9-10H2,(H,22,23)/t15-,17-,18-,19+,20+/m1/s1
NCI pathway
Reactome pathway
n/an/a 4.90E+6n/an/an/an/an/an/a
Texas Biotechnology Corporation
Curated by ChEMBL
Assay Description
In vitro inhibition of HL60 (human leukemia) cell binding to human recombinant e-selectin.
J Med Chem 38: 4976-84 (1996)
BindingDB Entry DOI: 10.7270/Q2B56KCP
Leukocyte adhesion molecule-1
(Mus musculus)
BDBM50422125
(CHEMBL2303942)
Show SMILES OC[C@H]1O[C@H](Oc2ccccc2-c2cccc(OCC(O)=O)c2)[C@@H](O)[C@H](O)[C@@H]1O |r|
Show InChI InChI=1S/C20H22O9/c21-9-15-17(24)18(25)19(26)20(29-15)28-14-7-2-1-6-13(14)11-4-3-5-12(8-11)27-10-16(22)23/h1-8,15,17-21,24-26H,9-10H2,(H,22,23)/t15-,17-,18-,19+,20+/m1/s1
Reactome pathway
n/an/a 1.70E+7n/an/an/an/an/an/a
Texas Biotechnology Corporation
Curated by ChEMBL
Assay Description
In vitro inhibitory activity against sialyl Lewis X expressing HL60 cell binding Selectin L
J Med Chem 38: 4976-84 (1996)
BindingDB Entry DOI: 10.7270/Q2B56KCP
P-selectin/P-selectin glycoprotein ligand 1
(Homo sapiens (Human))
BDBM50422125
(CHEMBL2303942)
Show SMILES OC[C@H]1O[C@H](Oc2ccccc2-c2cccc(OCC(O)=O)c2)[C@@H](O)[C@H](O)[C@@H]1O |r|
Show InChI InChI=1S/C20H22O9/c21-9-15-17(24)18(25)19(26)20(29-15)28-14-7-2-1-6-13(14)11-4-3-5-12(8-11)27-10-16(22)23/h1-8,15,17-21,24-26H,9-10H2,(H,22,23)/t15-,17-,18-,19+,20+/m1/s1
NCI pathway
Reactome pathway
n/an/a 4.90E+6n/an/an/an/an/an/a
Texas Biotechnology Corporation
Curated by ChEMBL
Assay Description
In vitro inhibitory activity against sialyl Lewis X expressing HL60 cell binding Selectin P
J Med Chem 38: 4976-84 (1996)
BindingDB Entry DOI: 10.7270/Q2B56KCP