BDBM50422277 CHEMBL118402
SMILES: NC(=N)c1ccc(cc1)C(=O)NCC(=O)N1CCN(CC(O)=O)C(=O)[C@@H]1CC(O)=O
InChI Key: InChIKey=WXSHDDWPXWECMG-LBPRGKRZSA-N
Data: 3 IC50
Activity Spreadsheet -- Enzyme Inhibition Constant Data from BindingDB
Found 3 hits for monomerid = 50422277
Trg + Lig
Ki
nM
ΔG°
kcal/mole
IC50
nM
Kd
nM
EC50/IC50
nM
koff
s-1
kon
M-1s-1
pHTemp
°C
Integrin alpha-IIb/beta-3
(Homo sapiens (Human))
BDBM50422277
(CHEMBL118402)
Show SMILES NC(=N)c1ccc(cc1)C(=O)NCC(=O)N1CCN(CC(O)=O)C(=O)[C@@H]1CC(O)=O
Show InChI InChI=1S/C18H21N5O7/c19-16(20)10-1-3-11(4-2-10)17(29)21-8-13(24)23-6-5-22(9-15(27)28)18(30)12(23)7-14(25)26/h1-4,12H,5-9H2,(H3,19,20)(H,21,29)(H,25,26)(H,27,28)/t12-/m0/s1
n/an/a 1n/an/an/an/an/an/a
Takeda Chemical Industries, Ltd.
Curated by ChEMBL
Assay Description
Ability to inhibit binding of biotin-labeled human fibrinogen to immobilized fibrinogen receptor purified from human erythroleukemia(HEL) cells.
J Med Chem 41: 489-502 (1998)
Article DOI: 10.1021/jm970235u
BindingDB Entry DOI: 10.7270/Q2571B4W
Integrin alpha-IIb/beta-3
(Homo sapiens (Human))
BDBM50422277
(CHEMBL118402)
Show SMILES NC(=N)c1ccc(cc1)C(=O)NCC(=O)N1CCN(CC(O)=O)C(=O)[C@@H]1CC(O)=O
Show InChI InChI=1S/C18H21N5O7/c19-16(20)10-1-3-11(4-2-10)17(29)21-8-13(24)23-6-5-22(9-15(27)28)18(30)12(23)7-14(25)26/h1-4,12H,5-9H2,(H3,19,20)(H,21,29)(H,25,26)(H,27,28)/t12-/m0/s1
n/an/a 110n/an/an/an/an/an/a
Takeda Chemical Industries, Ltd.
Curated by ChEMBL
Assay Description
Concentration required to inhibit adenosine diphosphate (ADP) induced aggregation of human platelets by 50% in vitro.
J Med Chem 41: 489-502 (1998)
Article DOI: 10.1021/jm970235u
BindingDB Entry DOI: 10.7270/Q2571B4W
Integrin alpha-IIb/beta-3
(Homo sapiens (Human))
BDBM50422277
(CHEMBL118402)
Show SMILES NC(=N)c1ccc(cc1)C(=O)NCC(=O)N1CCN(CC(O)=O)C(=O)[C@@H]1CC(O)=O
Show InChI InChI=1S/C18H21N5O7/c19-16(20)10-1-3-11(4-2-10)17(29)21-8-13(24)23-6-5-22(9-15(27)28)18(30)12(23)7-14(25)26/h1-4,12H,5-9H2,(H3,19,20)(H,21,29)(H,25,26)(H,27,28)/t12-/m0/s1
n/an/a 150n/an/an/an/an/an/a
Takeda Chemical Industries, Ltd.
Curated by ChEMBL
Assay Description
Concentration required to inhibit adenosine diphosphate (ADP) induced aggregation of guinea pig platelets by 50% in vitro
J Med Chem 41: 489-502 (1998)
Article DOI: 10.1021/jm970235u
BindingDB Entry DOI: 10.7270/Q2571B4W