BDBM50422437 CHEMBL273286
SMILES: OC(CCNCCCc1ccccc1)(P(O)(O)=O)P(O)(O)=O
InChI Key: InChIKey=VUBZETJGRXFONJ-UHFFFAOYSA-N
Data: 1 IC50
Activity Spreadsheet -- Enzyme Inhibition Constant Data from BindingDB
Found 1 hit for monomerid = 50422437
Trg + Lig
Ki
nM
ΔG°
kcal/mole
IC50
nM
Kd
nM
EC50/IC50
nM
koff
s-1
kon
M-1s-1
pHTemp
°C
Farnesyl diphosphate synthase
(Homo sapiens (Human))
BDBM50422437
(CHEMBL273286)
Show SMILES OC(CCNCCCc1ccccc1)(P(O)(O)=O)P(O)(O)=O
Show InChI InChI=1S/C12H21NO7P2/c14-12(21(15,16)17,22(18,19)20)8-10-13-9-4-7-11-5-2-1-3-6-11/h1-3,5-6,13-14H,4,7-10H2,(H2,15,16,17)(H2,18,19,20)
Reactome pathway
n/an/a 56n/an/an/an/an/an/a
University of Illinois at Urbana-Champaign
Curated by ChEMBL
Assay Description
Negative logarithm of inhibitory concentration against bone resorption
J Med Chem 46: 2932-44 (2003)
Article DOI: 10.1021/jm030054u
BindingDB Entry DOI: 10.7270/Q2R78GHD