BDBM50422440 CHEMBL98080
SMILES: CC(C)c1cnc(NC(P(O)(O)=O)P(O)(O)=O)s1
InChI Key: InChIKey=JICXOXOYMQTVDO-UHFFFAOYSA-N
Data: 1 IC50
Activity Spreadsheet -- Enzyme Inhibition Constant Data from BindingDB
Found 1 hit for monomerid = 50422440
Trg + Lig
Ki
nM
ΔG°
kcal/mole
IC50
nM
Kd
nM
EC50/IC50
nM
koff
s-1
kon
M-1s-1
pHTemp
°C
Farnesyl diphosphate synthase
(Homo sapiens (Human))
BDBM50422440
(CHEMBL98080)
Show SMILES CC(C)c1cnc(NC(P(O)(O)=O)P(O)(O)=O)s1
Show InChI InChI=1S/C7H14N2O6P2S/c1-4(2)5-3-8-6(18-5)9-7(16(10,11)12)17(13,14)15/h3-4,7H,1-2H3,(H,8,9)(H2,10,11,12)(H2,13,14,15)
Reactome pathway
n/an/a 632n/an/an/an/an/an/a
University of Illinois at Urbana-Champaign
Curated by ChEMBL
Assay Description
Negative logarithm of inhibitory concentration against bone resorption
J Med Chem 46: 2932-44 (2003)
Article DOI: 10.1021/jm030054u
BindingDB Entry DOI: 10.7270/Q2R78GHD