BDBM50422450 CHEMBL316663
SMILES: CN(CCCCOc1ccccc1)CCC(O)(P(O)(O)=O)P(O)(O)=O
InChI Key: InChIKey=PHJKOHNOPDCMQN-UHFFFAOYSA-N
Data: 1 IC50
Activity Spreadsheet -- Enzyme Inhibition Constant Data from BindingDB
Found 1 hit for monomerid = 50422450
Trg + Lig
Ki
nM
ΔG°
kcal/mole
IC50
nM
Kd
nM
EC50/IC50
nM
koff
s-1
kon
M-1s-1
pHTemp
°C
Farnesyl diphosphate synthase
(Homo sapiens (Human))
BDBM50422450
(CHEMBL316663)
Show SMILES CN(CCCCOc1ccccc1)CCC(O)(P(O)(O)=O)P(O)(O)=O
Show InChI InChI=1S/C14H25NO8P2/c1-15(10-5-6-12-23-13-7-3-2-4-8-13)11-9-14(16,24(17,18)19)25(20,21)22/h2-4,7-8,16H,5-6,9-12H2,1H3,(H2,17,18,19)(H2,20,21,22)
Reactome pathway
n/an/a 10n/an/an/an/an/an/a
University of Illinois at Urbana-Champaign
Curated by ChEMBL
Assay Description
Negative logarithm of inhibitory concentration against bone resorption
J Med Chem 46: 2932-44 (2003)
Article DOI: 10.1021/jm030054u
BindingDB Entry DOI: 10.7270/Q2R78GHD