BDBM50422451 CHEMBL98083
SMILES: OC(CCNCCc1ccccc1)(P(O)(O)=O)P(O)(O)=O
InChI Key: InChIKey=QQJDSVWRQXAWEY-UHFFFAOYSA-N
Data: 1 IC50
Activity Spreadsheet -- Enzyme Inhibition Constant Data from BindingDB
Found 1 hit for monomerid = 50422451
Trg + Lig
Ki
nM
ΔG°
kcal/mole
IC50
nM
Kd
nM
EC50/IC50
nM
koff
s-1
kon
M-1s-1
pHTemp
°C
Farnesyl diphosphate synthase
(Homo sapiens (Human))
BDBM50422451
(CHEMBL98083)
Show SMILES OC(CCNCCc1ccccc1)(P(O)(O)=O)P(O)(O)=O
Show InChI InChI=1S/C11H19NO7P2/c13-11(20(14,15)16,21(17,18)19)7-9-12-8-6-10-4-2-1-3-5-10/h1-5,12-13H,6-9H2,(H2,14,15,16)(H2,17,18,19)
Reactome pathway
n/an/a 885n/an/an/an/an/an/a
University of Illinois at Urbana-Champaign
Curated by ChEMBL
Assay Description
Negative logarithm of inhibitory concentration against bone resorption
J Med Chem 46: 2932-44 (2003)
Article DOI: 10.1021/jm030054u
BindingDB Entry DOI: 10.7270/Q2R78GHD