BDBM50422462 CHEMBL98211
SMILES: OC(CCc1cnc[nH]1)(P(O)(O)=O)P(O)(O)=O
InChI Key: InChIKey=OCVITJZAQBIHLG-UHFFFAOYSA-N
Data: 1 IC50
Activity Spreadsheet -- Enzyme Inhibition Constant Data from BindingDB
Found 1 hit for monomerid = 50422462
Trg + Lig
Ki
nM
ΔG°
kcal/mole
IC50
nM
Kd
nM
EC50/IC50
nM
koff
s-1
kon
M-1s-1
pHTemp
°C
Farnesyl diphosphate synthase
(Homo sapiens (Human))
BDBM50422462
(CHEMBL98211)
Show SMILES OC(CCc1cnc[nH]1)(P(O)(O)=O)P(O)(O)=O
Show InChI InChI=1S/C6H12N2O7P2/c9-6(16(10,11)12,17(13,14)15)2-1-5-3-7-4-8-5/h3-4,9H,1-2H2,(H,7,8)(H2,10,11,12)(H2,13,14,15)
Reactome pathway
n/an/a 67n/an/an/an/an/an/a
University of Illinois at Urbana-Champaign
Curated by ChEMBL
Assay Description
Negative logarithm of inhibitory concentration against bone resorption
J Med Chem 46: 2932-44 (2003)
Article DOI: 10.1021/jm030054u
BindingDB Entry DOI: 10.7270/Q2R78GHD