BDBM50422481 CHEMBL318861
SMILES: CCCN(CCCOc1ccccc1)CCC(O)(P(O)(O)=O)P(O)(O)=O
InChI Key: InChIKey=FUNWIKRSYZJMJY-UHFFFAOYSA-N
Data: 1 IC50
Activity Spreadsheet -- Enzyme Inhibition Constant Data from BindingDB
Found 1 hit for monomerid = 50422481
Trg + Lig
Ki
nM
ΔG°
kcal/mole
IC50
nM
Kd
nM
EC50/IC50
nM
koff
s-1
kon
M-1s-1
pHTemp
°C
Farnesyl diphosphate synthase
(Homo sapiens (Human))
BDBM50422481
(CHEMBL318861)
Show SMILES CCCN(CCCOc1ccccc1)CCC(O)(P(O)(O)=O)P(O)(O)=O
Show InChI InChI=1S/C15H27NO8P2/c1-2-10-16(11-6-13-24-14-7-4-3-5-8-14)12-9-15(17,25(18,19)20)26(21,22)23/h3-5,7-8,17H,2,6,9-13H2,1H3,(H2,18,19,20)(H2,21,22,23)
Reactome pathway
n/an/a 24n/an/an/an/an/an/a
University of Illinois at Urbana-Champaign
Curated by ChEMBL
Assay Description
Negative logarithm of inhibitory concentration against bone resorption
J Med Chem 46: 2932-44 (2003)
Article DOI: 10.1021/jm030054u
BindingDB Entry DOI: 10.7270/Q2R78GHD