BDBM50422531 BRIVARACETAM::UCB-34714
SMILES: CCC[C@H]1CN([C@@H](CC)C(N)=O)C(=O)C1
InChI Key: InChIKey=MSYKRHVOOPPJKU-BDAKNGLRSA-N
Data: 1 IC50
Activity Spreadsheet -- Enzyme Inhibition Constant Data from BindingDB
Found 1 hit for monomerid = 50422531
Trg + Lig
Ki
nM
ΔG°
kcal/mole
IC50
nM
Kd
nM
EC50/IC50
nM
koff
s-1
kon
M-1s-1
pHTemp
°C
Synaptic vesicle protein 2a
(Rattus norvegicus)
BDBM50422531
(BRIVARACETAM | UCB-34714)
Show SMILES CCC[C@H]1CN([C@@H](CC)C(N)=O)C(=O)C1 |r|
Show InChI InChI=1S/C11H20N2O2/c1-3-5-8-6-10(14)13(7-8)9(4-2)11(12)15/h8-9H,3-7H2,1-2H3,(H2,12,15)/t8-,9+/m1/s1
n/an/a 100n/an/an/an/an/an/a
UCB S.A.
Curated by ChEMBL
Assay Description
In vitro inhibitory activity against [3H](2S)-2-[4-(3-azidophenyl)-2-oxopyrrolidin-1-yl]butanamide binding to levetiracetam binding site
J Med Chem 47: 530-49 (2004)
Checked by Author
Article DOI: 10.1021/jm030913e
BindingDB Entry DOI: 10.7270/Q2GF0VQ6