BDBM50422551 CHEMBL358877
SMILES: CCCCCN(C(CC)C(N)=O)C(=O)CC
InChI Key: InChIKey=GKAUIDCAHLPJLP-UHFFFAOYSA-N
Data: 1 IC50
Activity Spreadsheet -- Enzyme Inhibition Constant Data from BindingDB
Found 1 hit for monomerid = 50422551
Trg + Lig
Ki
nM
ΔG°
kcal/mole
IC50
nM
Kd
nM
EC50/IC50
nM
koff
s-1
kon
M-1s-1
pHTemp
°C
Synaptic vesicle protein 2a
(Rattus norvegicus)
BDBM50422551
(CHEMBL358877)
Show SMILES CCCCCN(C(CC)C(N)=O)C(=O)CC
Show InChI InChI=1S/C12H24N2O2/c1-4-7-8-9-14(11(15)6-3)10(5-2)12(13)16/h10H,4-9H2,1-3H3,(H2,13,16)
n/an/a 2.00E+3n/an/an/an/an/an/a
UCB S.A.
Curated by ChEMBL
Assay Description
In vitro inhibitory activity against [3H](2S)-2-[4-(3-azidophenyl)-2-oxopyrrolidin-1-yl]butanamide binding to levetiracetam binding site
J Med Chem 47: 530-49 (2004)
Checked by Author
Article DOI: 10.1021/jm030913e
BindingDB Entry DOI: 10.7270/Q2GF0VQ6