null
SMILES: CC[C@H](N1C[C@H](CF)CC1=O)C(N)=O
InChI Key: InChIKey=KRDBHFRRBKEHEQ-BQBZGAKWSA-N
Activity Spreadsheet -- Enzyme Inhibition Constant Data from BindingDB
Found 1 hit for monomerid = 50422555
Trg + Lig
Ki
nM
ΔG°
kcal/mole
IC50
nM
Kd
nM
EC50/IC50
nM
koff
s-1
kon
M-1s-1
pHTemp
°C
Synaptic vesicle glycoprotein 2A
(Rattus norvegicus)
BDBM50422555
(CHEMBL346223)
Show SMILES CC[C@H](N1C[C@H](CF)CC1=O)C(N)=O
Show InChI InChI=1S/C9H15FN2O2/c1-2-7(9(11)14)12-5-6(4-10)3-8(12)13/h6-7H,2-5H2,1H3,(H2,11,14)/t6-,7-/m0/s1
n/an/a 1.26E+3n/an/an/an/an/an/a
UCB S.A.
Curated by ChEMBL
Assay Description
In vitro inhibitory activity against [3H](2S)-2-[4-(3-azidophenyl)-2-oxopyrrolidin-1-yl]butanamide binding to levetiracetam binding site
J Med Chem 47: 530-49 (2004)
Checked by Author
Article DOI: 10.1021/jm030913e
BindingDB Entry DOI: 10.7270/Q2GF0VQ6