BDBM50422666 CHEMBL607492
SMILES: ON(CCCP(O)(O)=O)C(=O)c1ccccc1
InChI Key: InChIKey=IIWMVQGECOWGCK-UHFFFAOYSA-N
Data: 2 IC50
Activity Spreadsheet -- Enzyme Inhibition Constant Data from BindingDB
Found 2 hits for monomerid = 50422666
Trg + Lig
Ki
nM
ΔG°
kcal/mole
IC50
nM
Kd
nM
EC50/IC50
nM
koff
s-1
kon
M-1s-1
pHTemp
°C
1-deoxy-D-xylulose 5-phosphate reductoisomerase
(Escherichia coli)
BDBM50422666
(CHEMBL607492)
Show SMILES ON(CCCP(O)(O)=O)C(=O)c1ccccc1
Show InChI InChI=1S/C10H14NO5P/c12-10(9-5-2-1-3-6-9)11(13)7-4-8-17(14,15)16/h1-3,5-6,13H,4,7-8H2,(H2,14,15,16)
n/an/a 100n/an/an/an/an/an/a
Philipps University
Curated by ChEMBL
Assay Description
Inhibitory concentration against DOXP reductoisomerase
J Med Chem 48: 3547-63 (2005)
Article DOI: 10.1021/jm0491501
BindingDB Entry DOI: 10.7270/Q2VH5Q21
1-deoxy-D-xylulose 5-phosphate reductoisomerase
(Mycobacterium tuberculosis)
BDBM50422666
(CHEMBL607492)
Show SMILES ON(CCCP(O)(O)=O)C(=O)c1ccccc1
Show InChI InChI=1S/C10H14NO5P/c12-10(9-5-2-1-3-6-9)11(13)7-4-8-17(14,15)16/h1-3,5-6,13H,4,7-8H2,(H2,14,15,16)
n/an/a 2.00E+3n/an/an/an/an/an/a
Uppsala University
Curated by ChEMBL
Assay Description
Inhibition of Mycobacterium tuberculosis DXR using DXP as substrate measured every 5 secs for 250 secs in presence of NADPH
J Med Chem 56: 6190-9 (2013)
Article DOI: 10.1021/jm4006498
BindingDB Entry DOI: 10.7270/Q2S183W1