BDBM50422833 CHEMBL202852
SMILES: CCCCCOc1c(OC)ccc2cc(C(=O)NCc3ccccc3)c(=O)[nH]c12
InChI Key: InChIKey=MQVLPPCWRNOADO-UHFFFAOYSA-N
Data: 1 IC50
Activity Spreadsheet -- Enzyme Inhibition Constant Data from BindingDB
Found 1 hit for monomerid = 50422833
Trg + Lig
Ki
nM
ΔG°
kcal/mole
IC50
nM
Kd
nM
EC50/IC50
nM
koff
s-1
kon
M-1s-1
pHTemp
°C
Cannabinoid receptor 2
(Homo sapiens (Human))
BDBM50422833
(CHEMBL202852)
Show SMILES CCCCCOc1c(OC)ccc2cc(C(=O)NCc3ccccc3)c(=O)[nH]c12
Show InChI InChI=1S/C23H26N2O4/c1-3-4-8-13-29-21-19(28-2)12-11-17-14-18(23(27)25-20(17)21)22(26)24-15-16-9-6-5-7-10-16/h5-7,9-12,14H,3-4,8,13,15H2,1-2H3,(H,24,26)(H,25,27)
Reactome pathway
n/an/a 63n/an/an/an/an/an/a
University of Kuopio
Curated by ChEMBL
Assay Description
Inhibition of [35S]GTP-gamma-S binding to human CB2 receptor expressed in CHO cells
J Med Chem 49: 2022-7 (2006)
Article DOI: 10.1021/jm050879z
BindingDB Entry DOI: 10.7270/Q21J9C3R