BDBM50423062 CHEMBL242786
SMILES: O=C(NCCCc1cn2CCCc3cccc1c23)C1CCC1
InChI Key: InChIKey=QITDFJAPXZRMTE-UHFFFAOYSA-N
Data: 1 IC50
Activity Spreadsheet -- Enzyme Inhibition Constant Data from BindingDB
Found 1 hit for monomerid = 50423062
Trg + Lig
Ki
nM
ΔG°
kcal/mole
IC50
nM
Kd
nM
EC50/IC50
nM
koff
s-1
kon
M-1s-1
pHTemp
°C
Melatonin 1C
(Xenopus)
BDBM50423062
(CHEMBL242786)
Show SMILES O=C(NCCCc1cn2CCCc3cccc1c23)C1CCC1
Show InChI InChI=1S/C19H24N2O/c22-19(15-6-1-7-15)20-11-3-8-16-13-21-12-4-9-14-5-2-10-17(16)18(14)21/h2,5,10,13,15H,1,3-4,6-9,11-12H2,(H,20,22)
n/an/a 1.59E+3n/an/an/an/an/an/a
University of Athens
Curated by ChEMBL
Assay Description
Antagonist activity in Xenopus laevis melanophores assessed as melatoninergic activity after 60 mins
Eur J Med Chem 42: 1004-13 (2007)
Article DOI: 10.1016/j.ejmech.2007.01.005
BindingDB Entry DOI: 10.7270/Q2B859BK