BDBM50423201 CHEMBL246303
SMILES: Cc1ccc(NC(=O)c2cccc(c2)C#N)cc1S(=O)(=O)N1CCOCC1
InChI Key: InChIKey=VBFCYYGBKWFUMQ-UHFFFAOYSA-N
Data: 1 IC50
Activity Spreadsheet -- Enzyme Inhibition Constant Data from BindingDB
Found 1 hit for monomerid = 50423201
Trg + Lig
Ki
nM
ΔG°
kcal/mole
IC50
nM
Kd
nM
EC50/IC50
nM
koff
s-1
kon
M-1s-1
pHTemp
°C
Cannabinoid receptor 1
(Homo sapiens (Human))
BDBM50423201
(CHEMBL246303)
Show SMILES Cc1ccc(NC(=O)c2cccc(c2)C#N)cc1S(=O)(=O)N1CCOCC1
Show InChI InChI=1S/C19H19N3O4S/c1-14-5-6-17(21-19(23)16-4-2-3-15(11-16)13-20)12-18(14)27(24,25)22-7-9-26-10-8-22/h2-6,11-12H,7-10H2,1H3,(H,21,23)
NCI pathway
Reactome pathway
n/an/a 1.59E+3n/an/an/an/an/an/a
UCB S.A.
Curated by ChEMBL
Assay Description
Binding affinity to human recombinant CB1 receptor
Bioorg Med Chem Lett 17: 272-7 (2006)
Article DOI: 10.1016/j.bmcl.2006.09.049
BindingDB Entry DOI: 10.7270/Q2FN17GR