BDBM50423208 CHEMBL246302
SMILES: Oc1ccccc1NC(=O)c1ccc(Cl)c(c1)S(=O)(=O)N1CCCCCC1
InChI Key: InChIKey=GCUYAWPJTIMKNJ-UHFFFAOYSA-N
Data: 1 IC50
Activity Spreadsheet -- Enzyme Inhibition Constant Data from BindingDB
Found 1 hit for monomerid = 50423208
Trg + Lig
Ki
nM
ΔG°
kcal/mole
IC50
nM
Kd
nM
EC50/IC50
nM
koff
s-1
kon
M-1s-1
pHTemp
°C
Cannabinoid receptor 1
(Homo sapiens (Human))
BDBM50423208
(CHEMBL246302)
Show SMILES Oc1ccccc1NC(=O)c1ccc(Cl)c(c1)S(=O)(=O)N1CCCCCC1
Show InChI InChI=1S/C19H21ClN2O4S/c20-15-10-9-14(19(24)21-16-7-3-4-8-17(16)23)13-18(15)27(25,26)22-11-5-1-2-6-12-22/h3-4,7-10,13,23H,1-2,5-6,11-12H2,(H,21,24)
NCI pathway
Reactome pathway
n/an/a 200n/an/an/an/an/an/a
UCB S.A.
Curated by ChEMBL
Assay Description
Binding affinity to human recombinant CB1 receptor
Bioorg Med Chem Lett 17: 272-7 (2006)
Article DOI: 10.1016/j.bmcl.2006.09.049
BindingDB Entry DOI: 10.7270/Q2FN17GR