BDBM50423209 CHEMBL247331
SMILES: O=C(Oc1cccc2cccnc12)c1cccc(c1)S(=O)(=O)N1CCCCC1
InChI Key: InChIKey=FKSCKADVXKOVHL-UHFFFAOYSA-N
Data: 1 IC50
Activity Spreadsheet -- Enzyme Inhibition Constant Data from BindingDB
Found 1 hit for monomerid = 50423209
Trg + Lig
Ki
nM
ΔG°
kcal/mole
IC50
nM
Kd
nM
EC50/IC50
nM
koff
s-1
kon
M-1s-1
pHTemp
°C
Cannabinoid receptor 1
(Homo sapiens (Human))
BDBM50423209
(CHEMBL247331)
Show SMILES O=C(Oc1cccc2cccnc12)c1cccc(c1)S(=O)(=O)N1CCCCC1
Show InChI InChI=1S/C21H20N2O4S/c24-21(27-19-11-5-7-16-9-6-12-22-20(16)19)17-8-4-10-18(15-17)28(25,26)23-13-2-1-3-14-23/h4-12,15H,1-3,13-14H2
NCI pathway
Reactome pathway
n/an/a 16n/an/an/an/an/an/a
UCB S.A.
Curated by ChEMBL
Assay Description
Binding affinity to human recombinant CB1 receptor
Bioorg Med Chem Lett 17: 272-7 (2006)
Article DOI: 10.1016/j.bmcl.2006.09.049
BindingDB Entry DOI: 10.7270/Q2FN17GR