BDBM50423213 CHEMBL248344
SMILES: Cc1ccc(cc1S(=O)(=O)N1CCCCC1)C(=O)Nc1cccc(F)c1
InChI Key: InChIKey=GUQQKXFNVGXNPW-UHFFFAOYSA-N
Data: 1 IC50
Activity Spreadsheet -- Enzyme Inhibition Constant Data from BindingDB
Found 1 hit for monomerid = 50423213
Trg + Lig
Ki
nM
ΔG°
kcal/mole
IC50
nM
Kd
nM
EC50/IC50
nM
koff
s-1
kon
M-1s-1
pHTemp
°C
Cannabinoid receptor 1
(Homo sapiens (Human))
BDBM50423213
(CHEMBL248344)
Show SMILES Cc1ccc(cc1S(=O)(=O)N1CCCCC1)C(=O)Nc1cccc(F)c1
Show InChI InChI=1S/C19H21FN2O3S/c1-14-8-9-15(19(23)21-17-7-5-6-16(20)13-17)12-18(14)26(24,25)22-10-3-2-4-11-22/h5-9,12-13H,2-4,10-11H2,1H3,(H,21,23)
NCI pathway
Reactome pathway
n/an/a 1.26E+3n/an/an/an/an/an/a
UCB S.A.
Curated by ChEMBL
Assay Description
Binding affinity to human recombinant CB1 receptor
Bioorg Med Chem Lett 17: 272-7 (2006)
Article DOI: 10.1016/j.bmcl.2006.09.049
BindingDB Entry DOI: 10.7270/Q2FN17GR