null
SMILES: COc1ccc2nccc(C3CN(C4CCN(Cc5ccc(cc5)C#N)CC4)C(=O)O3)c2c1
InChI Key: InChIKey=LZRXJGYRQJPRJM-UHFFFAOYSA-N
Activity Spreadsheet -- Enzyme Inhibition Constant Data from BindingDB
Found 1 hit for monomerid = 50423247
Trg + Lig
Ki
nM
ΔG°
kcal/mole
IC50
nM
Kd
nM
EC50/IC50
nM
koff
s-1
kon
M-1s-1
pHTemp
°C
C-C chemokine receptor type 8
(Homo sapiens (Human))
BDBM50423247
(CHEMBL395423)
Show SMILES COc1ccc2nccc(C3CN(C4CCN(Cc5ccc(cc5)C#N)CC4)C(=O)O3)c2c1
Show InChI InChI=1S/C26H26N4O3/c1-32-21-6-7-24-23(14-21)22(8-11-28-24)25-17-30(26(31)33-25)20-9-12-29(13-10-20)16-19-4-2-18(15-27)3-5-19/h2-8,11,14,20,25H,9-10,12-13,16-17H2,1H3
Reactome pathway
n/an/a 1.26E+4n/an/an/an/an/an/a
GlaxoSmithKline
Curated by ChEMBL
Assay Description
Antagonist activity at human recombinant CCR8 expressed in RBL cells assessed as inhibition of I-309-induced intracellular calcium mobilization by FL...
Bioorg Med Chem Lett 17: 1722-5 (2007)
Article DOI: 10.1016/j.bmcl.2006.12.076
BindingDB Entry DOI: 10.7270/Q2668FG7