null
SMILES: COc1ccc(CN2CCC(CC2)N2CC(OC2=O)c2ccnc3ccc(OC)cc23)cc1
InChI Key: InChIKey=QPSAYNQDLOGFNA-UHFFFAOYSA-N
Activity Spreadsheet -- Enzyme Inhibition Constant Data from BindingDB
Found 1 hit for monomerid = 50423252
Trg + Lig
Ki
nM
ΔG°
kcal/mole
IC50
nM
Kd
nM
EC50/IC50
nM
koff
s-1
kon
M-1s-1
pHTemp
°C
C-C chemokine receptor type 8
(Homo sapiens (Human))
BDBM50423252
(CHEMBL248171)
Show SMILES COc1ccc(CN2CCC(CC2)N2CC(OC2=O)c2ccnc3ccc(OC)cc23)cc1
Show InChI InChI=1S/C26H29N3O4/c1-31-20-5-3-18(4-6-20)16-28-13-10-19(11-14-28)29-17-25(33-26(29)30)22-9-12-27-24-8-7-21(32-2)15-23(22)24/h3-9,12,15,19,25H,10-11,13-14,16-17H2,1-2H3
Reactome pathway
n/an/a 1.26E+3n/an/an/an/an/an/a
GlaxoSmithKline
Curated by ChEMBL
Assay Description
Antagonist activity at human recombinant CCR8 expressed in RBL cells assessed as inhibition of I-309-induced intracellular calcium mobilization by FL...
Bioorg Med Chem Lett 17: 1722-5 (2007)
Article DOI: 10.1016/j.bmcl.2006.12.076
BindingDB Entry DOI: 10.7270/Q2668FG7