null
SMILES: COc1ccc2nccc(C3CN(C4CCN(Cc5cccc(Cl)c5)CC4)C(=O)O3)c2c1
InChI Key: InChIKey=ZBEZRCJKLIAIJX-UHFFFAOYSA-N
Activity Spreadsheet -- Enzyme Inhibition Constant Data from BindingDB
Found 1 hit for monomerid = 50423261
Trg + Lig
Ki
nM
ΔG°
kcal/mole
IC50
nM
Kd
nM
EC50/IC50
nM
koff
s-1
kon
M-1s-1
pHTemp
°C
C-C chemokine receptor type 8
(Homo sapiens (Human))
BDBM50423261
(CHEMBL248169)
Show SMILES COc1ccc2nccc(C3CN(C4CCN(Cc5cccc(Cl)c5)CC4)C(=O)O3)c2c1
Show InChI InChI=1S/C25H26ClN3O3/c1-31-20-5-6-23-22(14-20)21(7-10-27-23)24-16-29(25(30)32-24)19-8-11-28(12-9-19)15-17-3-2-4-18(26)13-17/h2-7,10,13-14,19,24H,8-9,11-12,15-16H2,1H3
Reactome pathway
n/an/a 6.31E+3n/an/an/an/an/an/a
GlaxoSmithKline
Curated by ChEMBL
Assay Description
Antagonist activity at human recombinant CCR8 expressed in RBL cells assessed as inhibition of I-309-induced intracellular calcium mobilization by FL...
Bioorg Med Chem Lett 17: 1722-5 (2007)
Article DOI: 10.1016/j.bmcl.2006.12.076
BindingDB Entry DOI: 10.7270/Q2668FG7